GitLab is used only for code review, issue tracking and project management. Canonical locations for source code are still https://gitweb.torproject.org/ https://git.torproject.org/ and git-rw.torproject.org.

test_util: remove directory special case

This was apparently a workaround for #40141, but should not be necessary with !164 merged.
9 jobs for Hello71-master-patch-95345 in 46 minutes and 43 seconds (queued for 14 seconds)
Status Job ID Name Coverage
  Test
failed #7934
debian-disable-dirauth

00:05:46

failed #7935
debian-disable-relay

00:09:15

failed #7930
debian-distcheck

00:13:12

passed #7931
debian-docs

00:08:45

failed #7929
debian-hardened

00:15:40

failed #7932
debian-integration

00:17:38

failed #7928
debian-minimal

00:06:51

failed #7936
debian-nss

00:05:41

failed #7933
debian-tracing

00:12:27

 
Name Stage Failure
failed
debian-disable-relay Test
+ exit 77
SKIP src/test/test_include.sh (exit status: 77)

Uploading artifacts for failed job
Uploading artifacts...
artifacts/: found 2 matching files and directories

Uploading artifacts as "archive" to coordinator... ok
id=7935 responseStatus=201 Created token=RWNpyC51
Cleaning up file based variables
ERROR: Job failed: exit code 1
failed
debian-nss Test
FAIL src/test/unittest_part8.sh (exit status: 1)

FATAL ERROR: Failed tests: check
Uploading artifacts for failed job
Uploading artifacts...
artifacts/: found 2 matching files and directories

Uploading artifacts as "archive" to coordinator... ok
id=7936 responseStatus=201 Created token=7tp3eeiy
Cleaning up file based variables
ERROR: Job failed: exit code 1
failed
debian-disable-dirauth Test
FAIL src/test/unittest_part8.sh (exit status: 1)

FATAL ERROR: Failed tests: check
Uploading artifacts for failed job
Uploading artifacts...
artifacts/: found 2 matching files and directories

Uploading artifacts as "archive" to coordinator... ok
id=7934 responseStatus=201 Created token=fRNHjvpB
Cleaning up file based variables
ERROR: Job failed: exit code 1
failed
debian-tracing Test
make: *** [Makefile:25714: show-distdir-core] Error 127
ERROR: command 'make show-distdir-core' has failed.
FATAL ERROR: Unable to continue.
Uploading artifacts for failed job
Uploading artifacts...
artifacts/: found 1 matching files and directories

Uploading artifacts as "archive" to coordinator... ok
id=7933 responseStatus=201 Created token=BoNwnk4G
Cleaning up file based variables
ERROR: Job failed: exit code 1
failed
debian-integration Test
01/09/2021 19:51:11 [NOTICE] Beginning test test.integ.process.TestProcess
01/09/2021 19:51:16 [NOTICE] Finished test test.integ.process.TestProcess
FATAL ERROR: Failed tests: stem
Uploading artifacts for failed job
Uploading artifacts...
artifacts/: found 2 matching files and directories

Uploading artifacts as "archive" to coordinator... ok
id=7932 responseStatus=201 Created token=C-Ge-BF2
Cleaning up file based variables
ERROR: Job failed: exit code 1
failed
debian-distcheck Test
make: *** [Makefile:25714: show-distdir-core] Error 127
ERROR: command 'make show-distdir-core' has failed.
FATAL ERROR: Unable to continue.
Uploading artifacts for failed job
Uploading artifacts...
artifacts/: found 1 matching files and directories

Uploading artifacts as "archive" to coordinator... ok
id=7930 responseStatus=201 Created token=UEgAL-wh
Cleaning up file based variables
ERROR: Job failed: exit code 1
failed
debian-hardened Test
make[1]: Leaving directory '/builds/Hello71/tor/build'
make: *** [Makefile:7348: all] Error 2
ERROR: command 'make -j4 -k all' has failed.
Uploading artifacts for failed job
Uploading artifacts...
artifacts/: found 1 matching files and directories

Uploading artifacts as "archive" to coordinator... ok
id=7929 responseStatus=201 Created token=hYtyQZi-
Cleaning up file based variables
ERROR: Job failed: exit code 1
failed
debian-minimal Test
FAIL src/test/unittest_part8.sh (exit status: 1)

FATAL ERROR: Failed tests: check
Uploading artifacts for failed job
Uploading artifacts...
artifacts/: found 2 matching files and directories

Uploading artifacts as "archive" to coordinator... ok
id=7928 responseStatus=201 Created token=MbgYrXs6
Cleaning up file based variables
ERROR: Job failed: exit code 1