make it compile again

9 jobs for bug40078-test-vectors in 24 minutes and 7 seconds (queued for 7 minutes and 37 seconds)
latest
Status Name Job ID Coverage
  Test
failed debian-disable-dirauth #30549

00:09:48

failed debian-disable-relay #30550

00:10:16

failed debian-distcheck #30545

00:09:34

passed debian-docs #30546

00:04:55

failed debian-hardened #30544

00:07:58

passed debian-integration #30547

00:16:58

failed debian-minimal #30543

00:09:26

failed debian-nss #30551

00:10:19

failed debian-tracing #30548

00:12:56

 
Name Stage Failure
failed
debian-tracing Test
make: *** [Makefile:25605: show-distdir-core] Error 127
ERROR: command 'make show-distdir-core' has failed.
FATAL ERROR: Unable to continue.
Uploading artifacts for failed job
Uploading artifacts...
artifacts/: found 1 matching files and directories

Uploading artifacts as "archive" to coordinator... ok
id=30548 responseStatus=201 Created token=nNKmuRyT
Cleaning up file based variables
ERROR: Job failed: exit code 1
failed
debian-nss Test
SKIP src/test/fuzz_static_testcases.sh (exit status: 77)

FATAL ERROR: Failed tests: check
Uploading artifacts for failed job
Uploading artifacts...
artifacts/: found 2 matching files and directories

Uploading artifacts as "archive" to coordinator... ok
id=30551 responseStatus=201 Created token=R8ozZjKT
Cleaning up file based variables
ERROR: Job failed: exit code 1
failed
debian-disable-relay Test
SKIP src/test/test_include.sh (exit status: 77)

FATAL ERROR: Failed tests: check
Uploading artifacts for failed job
Uploading artifacts...
artifacts/: found 2 matching files and directories

Uploading artifacts as "archive" to coordinator... ok
id=30550 responseStatus=201 Created token=TLn-pWN9
Cleaning up file based variables
ERROR: Job failed: exit code 1
failed
debian-disable-dirauth Test
SKIP src/test/fuzz_static_testcases.sh (exit status: 77)

FATAL ERROR: Failed tests: check
Uploading artifacts for failed job
Uploading artifacts...
artifacts/: found 2 matching files and directories

Uploading artifacts as "archive" to coordinator... ok
id=30549 responseStatus=201 Created token=4-sFgD6X
Cleaning up file based variables
ERROR: Job failed: exit code 1
failed
debian-distcheck Test
make: *** [Makefile:25605: show-distdir-core] Error 127
ERROR: command 'make show-distdir-core' has failed.
FATAL ERROR: Unable to continue.
Uploading artifacts for failed job
Uploading artifacts...
artifacts/: found 1 matching files and directories

Uploading artifacts as "archive" to coordinator... ok
id=30545 responseStatus=201 Created token=qPyxCDam
Cleaning up file based variables
ERROR: Job failed: exit code 1
failed
debian-hardened Test
make[1]: Leaving directory '/builds/asn/tor/build'
make: *** [Makefile:7324: all] Error 2
ERROR: command 'make -j4 -k all' has failed.
Uploading artifacts for failed job
Uploading artifacts...
artifacts/: found 1 matching files and directories

Uploading artifacts as "archive" to coordinator... ok
id=30544 responseStatus=201 Created token=7zV3QUc-
Cleaning up file based variables
ERROR: Job failed: exit code 1
failed
debian-minimal Test
SKIP src/test/fuzz_static_testcases.sh (exit status: 77)

FATAL ERROR: Failed tests: check
Uploading artifacts for failed job
Uploading artifacts...
artifacts/: found 2 matching files and directories

Uploading artifacts as "archive" to coordinator... ok
id=30543 responseStatus=201 Created token=74Djd_wZ
Cleaning up file based variables
ERROR: Job failed: exit code 1