.travis.yml 11.6 KB
Newer Older
1
language: c
2

teor's avatar
teor committed
3
4
cache:
  ccache: true
teor's avatar
teor committed
5
6
7
  ## cargo: true
  directories:
    - $HOME/.cargo
8
9
    ## caching CARGO_TARGET_DIR actually slows down the build over time,
    ## because old build products are never deleted.
teor's avatar
teor committed
10
    ## where we point CARGO_TARGET_DIR in all our cargo invocations
11
    #- $TRAVIS_BUILD_DIR/src/rust/target
teor's avatar
teor committed
12

teor's avatar
teor committed
13
14
compiler:
  - gcc
15
16
17
18

os:
  - linux

19
20
## We don't use the build matrix cross-product, because it makes too many jobs
## Instead, we list each job under matrix: include:
21
22
env:
  global:
23
24
25
26
    ## The Travis CI environment allows us two cores, so let's use both.  Also,
    ## let's use the "-k" flag so that we get all of the compilation failures,
    ## not just the first one.
    - MAKEFLAGS="-k -j 2"
teor's avatar
teor committed
27
28
29
    ## We turn on hardening by default
    ## Also known as --enable-fragile-hardening in 0.3.0.3-alpha and later
    - HARDENING_OPTIONS="--enable-expensive-hardening"
teor's avatar
teor committed
30
31
    ## We turn off asciidoc by default, because it's slow
    - ASCIIDOC_OPTIONS="--disable-asciidoc"
teor's avatar
teor committed
32
  matrix:
33
    ## This matrix entry is required, but it doesn't actually create any jobs
teor's avatar
teor committed
34
    -
35
36

matrix:
37
  ## include creates builds with gcc, linux, unless we override those defaults
teor's avatar
teor committed
38
  include:
39
    ## We run basic tests on macOS
40
41
    - compiler: clang
      os: osx
teor's avatar
teor committed
42
43
      ## Turn off some newer features, turn on clang's -Wtypedef-redefinition
      env: C_DIALECT_OPTIONS="-std=gnu99"
44
    ## We check NSS
teor's avatar
teor committed
45
46
    ## Use -std=gnu99 to turn off some newer features, and maybe turn on some
    ## extra gcc warnings?
47
    - env: NSS_OPTIONS="--enable-nss" C_DIALECT_OPTIONS="-std=gnu99"
48
    ## We run chutney on Linux, because it's faster than chutney on macOS
49
    ## Chutney is a fast job, clang is slower on Linux, so we do Chutney clang
50
    - env: CHUTNEY="yes" CHUTNEY_ALLOW_FAILURES="2" SKIP_MAKE_CHECK="yes"
51
      compiler: clang
52
53
54
55
      ## (Linux only) Use an older Linux image (Ubuntu Trusty)
      ## The Xenial and Bionic images cause permissions issues for chutney,
      ## this is a workaround, until we fix #32240.
      dist: trusty
teor's avatar
teor committed
56
    ## We check asciidoc with distcheck, to make sure we remove doc products
57
    ## We use Linux clang, because there are no other Linux clang jobs
58
    - env: DISTCHECK="yes" ASCIIDOC_OPTIONS="" SKIP_MAKE_CHECK="yes"
59
      compiler: clang
teor's avatar
teor committed
60
61
    ## We include a single coverage build with the best options for coverage
    - env: COVERAGE_OPTIONS="--enable-coverage" HARDENING_OPTIONS=""
62
63
64
    ## We run rust on Linux, because it's faster than rust on macOS
    ## We check rust offline
    - env: RUST_OPTIONS="--enable-rust" TOR_RUST_DEPENDENCIES=true
teor's avatar
teor committed
65
    ## We check asciidoc with distcheck, to make sure we remove doc products
66
    - env: DISTCHECK="yes" ASCIIDOC_OPTIONS="" SKIP_MAKE_CHECK="yes"
67
    ## We check disable module dirauth
68
    - env: MODULES_OPTIONS="--disable-module-dirauth"
teor's avatar
teor committed
69
70
71
    ## macOS builds are very slow, and we have a limited number of
    ## concurrent macOS jobs. We're not actively developing Rust, so it is
    ## the lowest priority.
72
    ## We run rust on macOS, because we have seen macOS rust failures before
teor's avatar
teor committed
73
74
75
    #- env: RUST_OPTIONS="--enable-rust --enable-cargo-online-mode"
    #  compiler: clang
    #  os: osx
76
    ## We run chutney on macOS, because macOS Travis has IPv6
77
78
    - env: CHUTNEY="yes" CHUTNEY_ALLOW_FAILURES="2" SKIP_MAKE_CHECK="yes"
      os: osx
79
    ## We clone our stem repo and run `make test-stem`
80
    - env: TEST_STEM="yes" SKIP_MAKE_CHECK="yes"
teor's avatar
teor committed
81

82
83
84
  ## Allow the build to report success (with non-required sub-builds
  ## continuing to run) if all required sub-builds have succeeded.
  fast_finish: true
85

86
  ## Careful! We use global envs, which makes it hard to allow failures by env:
teor's avatar
teor committed
87
  ## https://docs.travis-ci.com/user/customizing-the-build#matching-jobs-with-allow_failures
teor's avatar
teor committed
88
  allow_failures:
89
90
91
92
93
94
    ## macOS rust and chutney are very slow, so we let the build finish before
    ## they are done.  We'd like to fast finish, but still eventually show
    ## any failures in the build status. But Travis doesn't have that ability.
    - env: RUST_OPTIONS="--enable-rust --enable-cargo-online-mode"
      compiler: clang
      os: osx
95
96
    - env: CHUTNEY="yes" CHUTNEY_ALLOW_FAILURES="2" SKIP_MAKE_CHECK="yes"
      os: osx
teor's avatar
teor committed
97
    ## test-stem sometimes hangs on Travis
98
    - env: TEST_STEM="yes" SKIP_MAKE_CHECK="yes"
teor's avatar
teor committed
99

100
101
## (Linux only) Use a recent Linux image (Ubuntu Bionic)
dist: bionic
teor's avatar
teor committed
102

teor's avatar
teor committed
103
## Download our dependencies
teor's avatar
teor committed
104
addons:
teor's avatar
teor committed
105
  ## (Linux only)
teor's avatar
teor committed
106
107
108
109
  apt:
    packages:
      ## Required dependencies
      - libevent-dev
teor's avatar
teor committed
110
111
      ## Ubuntu comes with OpenSSL by default
      #- libssl-dev
teor's avatar
teor committed
112
113
114
      - zlib1g-dev
      ## Optional dependencies
      - libcap-dev
115
      - liblzma-dev
116
      - libnss3-dev
teor's avatar
teor committed
117
118
      - libscrypt-dev
      - libseccomp-dev
119
120
      ## zstd doesn't exist in Ubuntu Trusty
      #- libzstd
121
      - shellcheck
teor's avatar
teor committed
122
      ## Conditional build dependencies
teor's avatar
teor committed
123
124
125
126
127
      ## Always installed, so we don't need sudo
      - asciidoc
      - docbook-xsl
      - docbook-xml
      - xmlto
128
129
130
      ## Utilities
      ## preventing or diagnosing hangs
      - timelimit
teor's avatar
teor committed
131
132
133
134
135
136
137
138
139
140
141
142
  ## (OSX only)
  homebrew:
    packages:
      ## Required dependencies
      - libevent
      ## The OSX version of OpenSSL is way too old
      - openssl
      ## OSX comes with zlib by default
      ## to use a newer zlib, pass the keg path to configure (like OpenSSL)
      #- zlib
      ## Optional dependencies
      - libscrypt
143
144
      - xz
      - zstd
teor's avatar
teor committed
145
146
147
148
149
      ## Required build dependencies
      ## Tor needs pkg-config to find some dependencies at build time
      - pkg-config
      ## Optional build dependencies
      - ccache
150
      - shellcheck
teor's avatar
teor committed
151
152
153
154
      ## Conditional build dependencies
      ## Always installed, because manual brew installs are hard to get right
      - asciidoc
      - xmlto
155
156
157
      ## Utilities
      ## preventing or diagnosing hangs
      - timelimit
158

teor's avatar
teor committed
159
## (OSX only) Use a recent macOS image
teor's avatar
teor committed
160
## See https://docs.travis-ci.com/user/reference/osx#os-x-version
teor's avatar
teor committed
161
162
163
## Default is Xcode 9.4 on macOS 10.13 as of October 2019
## Recent is Xcode 11.2 on macOS 10.14 as of October 2019
osx_image: xcode11.2
teor's avatar
teor committed
164
165

before_install:
teor's avatar
teor committed
166
167
  ## Create empty rust directories for non-Rust builds, so caching succeeds
  - if [[ "$RUST_OPTIONS" == "" ]]; then mkdir -p $HOME/.cargo $TRAVIS_BUILD_DIR/src/rust/target; fi
teor's avatar
teor committed
168

169
install:
teor's avatar
teor committed
170
  ## If we're on OSX, configure ccache (ccache is automatically installed and configured on Linux)
teor's avatar
teor committed
171
  - if [[ "$TRAVIS_OS_NAME" == "osx" ]]; then export PATH="/usr/local/opt/ccache/libexec:$PATH"; fi
172
173
  ## If we're on OSX, OpenSSL is keg-only, so tor 0.2.9 and later need to be configured --with-openssl-dir= to build
  - if [[ "$TRAVIS_OS_NAME" == "osx" ]]; then OPENSSL_OPTIONS=--with-openssl-dir=`brew --prefix openssl`; fi
teor's avatar
teor committed
174
175
176
  ## Install conditional features
  ## Install coveralls
  - if [[ "$COVERAGE_OPTIONS" != "" ]]; then pip install --user cpp-coveralls; fi
teor's avatar
teor committed
177
  ## If we're on OSX, and using asciidoc, configure asciidoc
178
  - if [[ "$ASCIIDOC_OPTIONS" == "" ]] && [[ "$TRAVIS_OS_NAME" == "osx" ]]; then export XML_CATALOG_FILES="/usr/local/etc/xml/catalog"; fi
teor's avatar
teor committed
179
180
  ## If we're using Rust, download rustup
  - if [[ "$RUST_OPTIONS" != "" ]]; then curl -Ssf -o rustup.sh https://sh.rustup.rs; fi
181
182
  ## Install the nightly channels of rustc and cargo and setup our toolchain environment
  - if [[ "$RUST_OPTIONS" != "" ]]; then sh rustup.sh -y --default-toolchain nightly; fi
teor's avatar
teor committed
183
  - if [[ "$RUST_OPTIONS" != "" ]]; then source $HOME/.cargo/env; fi
teor's avatar
teor committed
184
  ## If we're testing rust builds in offline-mode, then set up our vendored dependencies
185
  - if [[ "$TOR_RUST_DEPENDENCIES" == "true" ]]; then export TOR_RUST_DEPENDENCIES=$PWD/src/ext/rust/crates; fi
186
187
  ## If we're running chutney, install it.
  - if [[ "$CHUTNEY" != "" ]]; then git clone --depth 1 https://github.com/torproject/chutney.git ; export CHUTNEY_PATH="$(pwd)/chutney"; fi
188
  ## If we're running stem, install it.
189
  - if [[ "$TEST_STEM" != "" ]]; then git clone --depth 1 https://github.com/torproject/stem.git ; export STEM_SOURCE_DIR=`pwd`/stem; fi
190
191
192
193
  ##
  ## Finally, list installed package versions
  - if [[ "$TRAVIS_OS_NAME" == "linux" ]]; then dpkg-query --show; fi
  - if [[ "$TRAVIS_OS_NAME" == "osx" ]]; then brew list --versions; fi
teor's avatar
teor committed
194
195
196
197
198
199
200
  ## Get some info about rustup, rustc and cargo
  - if [[ "$RUST_OPTIONS" != "" ]]; then which rustup; fi
  - if [[ "$RUST_OPTIONS" != "" ]]; then which rustc; fi
  - if [[ "$RUST_OPTIONS" != "" ]]; then which cargo; fi
  - if [[ "$RUST_OPTIONS" != "" ]]; then rustup --version; fi
  - if [[ "$RUST_OPTIONS" != "" ]]; then rustc --version; fi
  - if [[ "$RUST_OPTIONS" != "" ]]; then cargo --version; fi
201
202
  ## Get python version
  - python --version
203
204
  ## If we're running chutney, show the chutney commit
  - if [[ "$CHUTNEY" != "" ]]; then pushd "$CHUTNEY_PATH"; git log -1 ; popd ; fi
205
  ## If we're running stem, show the stem version and commit
rl1987's avatar
rl1987 committed
206
  - if [[ "$TEST_STEM" != "" ]]; then pushd stem; python -c "from stem import stem; print(stem.__version__);"; git log -1; popd; fi
207
208

script:
209
210
  # Skip test_rebind on macOS
  - if [[ "$TRAVIS_OS_NAME" == "osx" ]]; then export TOR_SKIP_TEST_REBIND=true; fi
211
  - ./autogen.sh
212
  - CONFIGURE_FLAGS="$ASCIIDOC_OPTIONS $COVERAGE_OPTIONS $HARDENING_OPTIONS $MODULES_OPTIONS $NSS_OPTIONS $OPENSSL_OPTIONS $RUST_OPTIONS --enable-fatal-warnings --disable-silent-rules"
teor's avatar
teor committed
213
214
  - echo "Configure flags are $CONFIGURE_FLAGS CC=\"$CC $C_DIALECT_OPTIONS\""
  - ./configure $CONFIGURE_FLAGS CC="$CC $C_DIALECT_OPTIONS"
215
  ## We run `make check` because that's what https://jenkins.torproject.org does.
216
  - if [[ "$SKIP_MAKE_CHECK" == "" ]]; then make check; fi
217
  - if [[ "$DISTCHECK" != "" ]]; then make distcheck DISTCHECK_CONFIGURE_FLAGS="$CONFIGURE_FLAGS"; fi
218
  - if [[ "$CHUTNEY" != "" ]]; then make test-network-all; fi
219
220
  ## Diagnostic for bug 29437: kill stem if it hangs for 9.5 minutes
  ## Travis will kill the job after 10 minutes with no output
221
  - if [[ "$TEST_STEM" != "" ]]; then make src/app/tor; timelimit -p -t 540 -s USR1 -T 30 -S ABRT python3 "$STEM_SOURCE_DIR"/run_tests.py --tor src/app/tor --integ --test control.controller --test control.base_controller --test process --log TRACE --log-file stem.log; fi
222
  ## If this build was one that produced coverage, upload it.
223
  - if [[ "$COVERAGE_OPTIONS" != "" ]]; then coveralls -b . --exclude src/test --exclude src/trunnel --gcov-options '\-p' || echo "Coverage failed"; fi
224

225
after_failure:
teor's avatar
teor committed
226
227
  ## configure will leave a log file with more details of config failures.
  ## But the log is too long for travis' rendered view, so tail it.
228
  - tail -1000 config.log || echo "tail failed"
229
  ## `make check` will leave a log file with more details of test failures.
230
  - if [[ "$SKIP_MAKE_CHECK" == "" ]]; then cat test-suite.log || echo "cat failed"; fi
231
  ## `make distcheck` puts it somewhere different.
232
  - if [[ "$DISTCHECK" != "" ]]; then make show-distdir-testlog || echo "make failed"; fi
Taylor Yu's avatar
Taylor Yu committed
233
  - if [[ "$DISTCHECK" != "" ]]; then make show-distdir-core || echo "make failed"; fi
234
  - if [[ "$CHUTNEY" != "" ]]; then ls test_network_log || echo "ls failed"; cat test_network_log/* || echo "cat failed"; fi
235
  - if [[ "$TEST_STEM" != "" ]]; then tail -1000 "$STEM_SOURCE_DIR"/test/data/tor_log || echo "tail failed"; fi
236
  - if [[ "$TEST_STEM" != "" ]]; then grep -v "SocketClosed" stem.log | tail -1000 || echo "grep | tail failed"; fi
237

238
before_cache:
239
  ## Delete all gcov files.
240
  - if [[ "$COVERAGE_OPTIONS" != "" ]]; then make reset-gcov; fi
241
242
243
  ## Delete the cargo registry before caching .cargo, because it's cheaper to
  ## download the registry and throw it away, rather than caching it
  - rm -rf $HOME/.cargo/registry
teor's avatar
teor committed
244
245
246
247
248
249
250
251
252
253
254
255
256

notifications:
  irc:
    channels:
      - "irc.oftc.net#tor-ci"
    template:
      - "%{repository} %{branch} %{commit} - %{author}: %{commit_subject}"
      - "Build #%{build_number} %{result}. Details: %{build_url}"
    on_success: change
    on_failure: change
  email:
    on_success: never
    on_failure: change