GitLab is used only for code review, issue tracking and project management. Canonical locations for source code are still https://gitweb.torproject.org/ https://git.torproject.org/ and git-rw.torproject.org.

relay: Allow a non-explicit ORPort IPv6 to fail to open

Fixes #40283

Signed-off-by: David Goulet <dgoulet@torproject.org>
9 jobs for ticket40283_045_01 in 16 minutes and 52 seconds (queued for 2 seconds)
latest
Status Job ID Name Coverage
  Test
failed #11400
debian-disable-dirauth

00:05:46

failed #11401
debian-disable-relay

00:05:36

failed #11396
debian-distcheck

00:07:26

passed #11397
debian-docs

00:03:15

failed #11395
debian-hardened

00:07:57

failed #11398
debian-integration

00:12:57

failed #11394
debian-minimal

00:06:12

failed #11402
debian-nss

00:05:26

failed #11399
debian-tracing

00:08:41

 
Name Stage Failure
failed
debian-integration Test
02/09/2021 16:17:34 [NOTICE] Finished test test.integ.control.controller.TestController
02/09/2021 16:17:34 [NOTICE] Beginning test test.integ.process.TestProcess
02/09/2021 16:17:36 [NOTICE] Finished test test.integ.process.TestProcess
FATAL ERROR: Failed tests: stem
Uploading artifacts for failed job
Uploading artifacts...
artifacts/: found 2 matching files and directories

Uploading artifacts as "archive" to coordinator... ok
id=11398 responseStatus=201 Created token=7zFRPqn4
ERROR: Job failed: exit code 1
failed
debian-tracing Test
make: *** [Makefile:25712: show-distdir-core] Error 127
ERROR: command 'make show-distdir-core' has failed.
FATAL ERROR: Unable to continue.
Uploading artifacts for failed job
Uploading artifacts...
artifacts/: found 1 matching files and directories

Uploading artifacts as "archive" to coordinator... ok
id=11399 responseStatus=201 Created token=9U-txPE9
Cleaning up file based variables
ERROR: Job failed: exit code 1
failed
debian-nss Test
1/176 TESTS FAILED. (1323 skipped)
FAIL src/test/unittest_part8.sh (exit status: 1)

FATAL ERROR: Failed tests: check
Uploading artifacts for failed job
Uploading artifacts...
artifacts/: found 2 matching files and directories

Uploading artifacts as "archive" to coordinator... ok
id=11402 responseStatus=201 Created token=tV1uDvx5
ERROR: Job failed: exit code 1
failed
debian-disable-relay Test
+ exit 77
SKIP src/test/test_include.sh (exit status: 77)

FATAL ERROR: Failed tests: check
Uploading artifacts for failed job
Uploading artifacts...
artifacts/: found 2 matching files and directories

Uploading artifacts as "archive" to coordinator... ok
id=11401 responseStatus=201 Created token=ceQnxfFK
ERROR: Job failed: exit code 1
failed
debian-disable-dirauth Test
1/154 TESTS FAILED. (1391 skipped)
FAIL src/test/unittest_part8.sh (exit status: 1)

FATAL ERROR: Failed tests: check
Uploading artifacts for failed job
Uploading artifacts...
artifacts/: found 2 matching files and directories

Uploading artifacts as "archive" to coordinator... ok
id=11400 responseStatus=201 Created token=T5bRvqkx
ERROR: Job failed: exit code 1
failed
debian-hardened Test
util/thread/conditionvar_timeout: [forking] OK
1/154 TESTS FAILED. (1391 skipped)
FAIL src/test/unittest_part8.sh (exit status: 1)

Uploading artifacts for failed job
Uploading artifacts...
artifacts/: found 2 matching files and directories

Uploading artifacts as "archive" to coordinator... ok
id=11395 responseStatus=201 Created token=wA3xVz4H
ERROR: Job failed: exit code 1
failed
debian-distcheck Test
/bin/bash: line 1: file: command not found
make: *** [Makefile:25712: show-distdir-core] Error 127
ERROR: command 'make show-distdir-core' has failed.
FATAL ERROR: Unable to continue.
Uploading artifacts for failed job
Uploading artifacts...
artifacts/: found 1 matching files and directories

Uploading artifacts as "archive" to coordinator... ok
id=11396 responseStatus=201 Created token=rvndMgjB
ERROR: Job failed: exit code 1
failed
debian-minimal Test
1/154 TESTS FAILED. (1391 skipped)
FAIL src/test/unittest_part8.sh (exit status: 1)

FATAL ERROR: Failed tests: check
Uploading artifacts for failed job
Uploading artifacts...
artifacts/: found 2 matching files and directories

Uploading artifacts as "archive" to coordinator... ok
id=11394 responseStatus=201 Created token=GagEoQGx
ERROR: Job failed: exit code 1