<?xml version="1.0" encoding="UTF-8" standalone="no"?>
<!-- Created with Inkscape (http://www.inkscape.org/) -->

<svg
   xmlns:dc="http://purl.org/dc/elements/1.1/"
   xmlns:cc="http://creativecommons.org/ns#"
   xmlns:rdf="http://www.w3.org/1999/02/22-rdf-syntax-ns#"
   xmlns:svg="http://www.w3.org/2000/svg"
   xmlns="http://www.w3.org/2000/svg"
   xmlns:sodipodi="http://sodipodi.sourceforge.net/DTD/sodipodi-0.dtd"
   xmlns:inkscape="http://www.inkscape.org/namespaces/inkscape"
   width="615.0293"
   height="193.32378"
   id="svg2"
   version="1.1"
   inkscape:version="0.48.0 r9654"
   sodipodi:docname="tor-extension.svg">
  <defs
     id="defs4" />
  <sodipodi:namedview
     id="base"
     pagecolor="#ffffff"
     bordercolor="#666666"
     borderopacity="1.0"
     inkscape:pageopacity="0.0"
     inkscape:pageshadow="2"
     inkscape:zoom="1.979899"
     inkscape:cx="431.52109"
     inkscape:cy="40.004513"
     inkscape:document-units="px"
     inkscape:current-layer="layer1"
     showgrid="true"
     inkscape:window-width="1920"
     inkscape:window-height="1126"
     inkscape:window-x="0"
     inkscape:window-y="26"
     inkscape:window-maximized="1"
     showguides="true"
     inkscape:guide-bbox="true"
     fit-margin-top="5"
     fit-margin-left="5"
     fit-margin-right="5"
     fit-margin-bottom="5">
    <inkscape:grid
       type="xygrid"
       id="grid4099"
       empspacing="5"
       visible="true"
       enabled="true"
       snapvisiblegridlinesonly="true"
       dotted="false"
       spacingx="5px"
       spacingy="5px" />
  </sodipodi:namedview>
  <metadata
     id="metadata7">
    <rdf:RDF>
      <cc:Work
         rdf:about="">
        <dc:format>image/svg+xml</dc:format>
        <dc:type
           rdf:resource="http://purl.org/dc/dcmitype/StillImage" />
        <dc:title />
      </cc:Work>
    </rdf:RDF>
  </metadata>
  <g
     inkscape:label="Layer 1"
     inkscape:groupmode="layer"
     id="layer1"
     transform="translate(-39.970699,-454.44196)">
    <rect
       transform="matrix(0,-1,1,0,0,0)"
       style="fill:#1a9850;fill-opacity:1;fill-rule:evenodd;stroke:none"
       id="rect3065"
       width="70"
       height="20"
       x="-562.76575"
       y="549.9707"
       rx="3.5"
       ry="5" />
    <rect
       ry="5"
       rx="5"
       y="492.76575"
       x="550"
       height="20"
       width="100"
       id="rect3375"
       style="fill:#1a9850;fill-opacity:1;fill-rule:evenodd;stroke:none" />
    <rect
       style="fill:#1a9850;fill-opacity:1;fill-rule:evenodd;stroke:none"
       id="rect3305"
       width="125"
       height="20"
       x="375"
       y="492.96753"
       rx="6.25"
       ry="5" />
    <rect
       ry="5"
       rx="3.5"
       y="480"
       x="-562.96753"
       height="20"
       width="70"
       id="rect3333"
       style="fill:#1a9850;fill-opacity:1;fill-rule:evenodd;stroke:none"
       transform="matrix(0,-1,1,0,0,0)" />
    <text
       sodipodi:linespacing="125%"
       id="text3167"
       y="472.56396"
       x="93.053833"
       style="font-size:18px;font-style:normal;font-variant:normal;font-weight:normal;font-stretch:normal;line-height:125%;letter-spacing:0px;word-spacing:0px;fill:#000000;fill-opacity:1;stroke:none;font-family:FreeSans;-inkscape-font-specification:FreeSans"
       xml:space="preserve"><tspan
         y="472.56396"
         x="93.053833"
         id="tspan3169"
         sodipodi:role="line">Initiator</tspan></text>
    <rect
       ry="5"
       rx="5"
       y="622.56396"
       x="75"
       height="20"
       width="100"
       id="rect3131"
       style="fill:#d73027;fill-opacity:1;fill-rule:evenodd;stroke:none" />
    <text
       sodipodi:linespacing="125%"
       id="text3133"
       y="637.30249"
       x="118.74756"
       style="font-size:12px;font-style:normal;font-variant:normal;font-weight:normal;font-stretch:normal;text-align:start;line-height:125%;letter-spacing:0px;word-spacing:0px;writing-mode:lr-tb;text-anchor:start;fill:#000000;fill-opacity:1;stroke:none;font-family:DejaVu Sans;-inkscape-font-specification:DejaVu Sans"
       xml:space="preserve"><tspan
         style="font-size:12px;font-style:normal;font-variant:normal;font-weight:normal;font-stretch:normal;text-align:start;line-height:125%;writing-mode:lr-tb;text-anchor:start;font-family:DejaVu Sans;-inkscape-font-specification:DejaVu Sans"
         y="637.30249"
         x="118.74756"
         id="tspan3135"
         sodipodi:role="line">IP</tspan></text>
    <rect
       style="fill:#fc8d59;fill-opacity:1;fill-rule:evenodd;stroke:none"
       id="rect3137"
       width="100"
       height="20"
       x="75"
       y="597.56396"
       rx="5"
       ry="5" />
    <text
       xml:space="preserve"
       style="font-size:12px;font-style:normal;font-variant:normal;font-weight:normal;font-stretch:normal;text-align:start;line-height:125%;letter-spacing:0px;word-spacing:0px;writing-mode:lr-tb;text-anchor:start;fill:#000000;fill-opacity:1;stroke:none;font-family:DejaVu Sans;-inkscape-font-specification:DejaVu Sans"
       x="113.18384"
       y="612.29614"
       id="text3139"
       sodipodi:linespacing="125%"><tspan
         sodipodi:role="line"
         id="tspan3141"
         x="113.18384"
         y="612.29614"
         style="font-size:12px;font-style:normal;font-variant:normal;font-weight:normal;font-stretch:normal;text-align:start;line-height:125%;writing-mode:lr-tb;text-anchor:start;font-family:DejaVu Sans;-inkscape-font-specification:DejaVu Sans">TCP</tspan></text>
    <rect
       ry="5"
       rx="5"
       y="567.96753"
       x="75"
       height="20"
       width="100"
       id="rect3143"
       style="fill:#fee08b;fill-opacity:1;fill-rule:evenodd;stroke:none" />
    <text
       sodipodi:linespacing="125%"
       id="text3145"
       y="582.49792"
       x="113.6631"
       style="font-size:12px;font-style:normal;font-variant:normal;font-weight:normal;font-stretch:normal;text-align:start;line-height:125%;letter-spacing:0px;word-spacing:0px;writing-mode:lr-tb;text-anchor:start;fill:#000000;fill-opacity:1;stroke:none;font-family:DejaVu Sans;-inkscape-font-specification:DejaVu Sans"
       xml:space="preserve"><tspan
         style="font-size:12px;font-style:normal;font-variant:normal;font-weight:normal;font-stretch:normal;text-align:start;line-height:125%;writing-mode:lr-tb;text-anchor:start;font-family:DejaVu Sans;-inkscape-font-specification:DejaVu Sans"
         y="582.49792"
         x="113.6631"
         id="tspan3147"
         sodipodi:role="line">TLS</tspan></text>
    <rect
       style="fill:#d9ef8b;fill-opacity:1;fill-rule:evenodd;stroke:none"
       id="rect3149"
       width="100"
       height="20"
       x="75"
       y="542.96753"
       rx="5"
       ry="5" />
    <text
       xml:space="preserve"
       style="font-size:12px;font-style:normal;font-variant:normal;font-weight:normal;font-stretch:normal;text-align:start;line-height:125%;letter-spacing:0px;word-spacing:0px;writing-mode:lr-tb;text-anchor:start;fill:#000000;fill-opacity:1;stroke:none;font-family:DejaVu Sans;-inkscape-font-specification:DejaVu Sans"
       x="103.84645"
       y="557.61218"
       id="text3151"
       sodipodi:linespacing="125%"><tspan
         sodipodi:role="line"
         id="tspan3153"
         x="103.84645"
         y="557.61218"
         style="font-size:12px;font-style:normal;font-variant:normal;font-weight:normal;font-stretch:normal;text-align:start;line-height:125%;writing-mode:lr-tb;text-anchor:start;font-family:DejaVu Sans;-inkscape-font-specification:DejaVu Sans">Circuit</tspan></text>
    <rect
       ry="5"
       rx="5"
       y="517.96753"
       x="75"
       height="20"
       width="100"
       id="rect3155"
       style="fill:#91cf60;fill-opacity:1;fill-rule:evenodd;stroke:none" />
    <text
       sodipodi:linespacing="125%"
       id="text3157"
       y="532.61218"
       x="95.727783"
       style="font-size:12px;font-style:normal;font-variant:normal;font-weight:normal;font-stretch:normal;text-align:start;line-height:125%;letter-spacing:0px;word-spacing:0px;writing-mode:lr-tb;text-anchor:start;fill:#000000;fill-opacity:1;stroke:none;font-family:DejaVu Sans;-inkscape-font-specification:DejaVu Sans"
       xml:space="preserve"><tspan
         style="font-size:12px;font-style:normal;font-variant:normal;font-weight:normal;font-stretch:normal;text-align:start;line-height:125%;writing-mode:lr-tb;text-anchor:start;font-family:DejaVu Sans;-inkscape-font-specification:DejaVu Sans"
         y="532.61218"
         x="95.727783"
         id="tspan3159"
         sodipodi:role="line">Cell Auth</tspan></text>
    <rect
       style="fill:#1a9850;fill-opacity:1;fill-rule:evenodd;stroke:none"
       id="rect3161"
       width="100"
       height="20"
       x="75"
       y="492.96753"
       rx="5"
       ry="5" />
    <text
       xml:space="preserve"
       style="font-size:12px;font-style:normal;font-variant:normal;font-weight:normal;font-stretch:normal;text-align:start;line-height:125%;letter-spacing:0px;word-spacing:0px;writing-mode:lr-tb;text-anchor:start;fill:#000000;fill-opacity:1;stroke:none;font-family:DejaVu Sans;-inkscape-font-specification:DejaVu Sans"
       x="107.45996"
       y="505.97083"
       id="text3163"
       sodipodi:linespacing="125%"><tspan
         sodipodi:role="line"
         id="tspan3165"
         x="107.45996"
         y="505.97083"
         style="font-size:12px;font-style:normal;font-variant:normal;font-weight:normal;font-stretch:normal;text-align:start;line-height:125%;writing-mode:lr-tb;text-anchor:start;font-family:DejaVu Sans;-inkscape-font-specification:DejaVu Sans">Setup</tspan></text>
    <rect
       style="fill:#d73027;fill-opacity:1;fill-rule:evenodd;stroke:none"
       id="rect3173"
       width="100"
       height="20"
       x="225"
       y="622.56396"
       rx="5"
       ry="5" />
    <text
       xml:space="preserve"
       style="font-size:13px;font-style:normal;font-variant:normal;font-weight:normal;font-stretch:normal;line-height:125%;letter-spacing:0px;word-spacing:0px;fill:#000000;fill-opacity:1;stroke:none;font-family:DejaVu Sans;-inkscape-font-specification:DejaVu Sans"
       x="268.74756"
       y="637.30249"
       id="text3175"
       sodipodi:linespacing="125%"><tspan
         sodipodi:role="line"
         id="tspan3177"
         x="268.74756"
         y="637.30249"
         style="font-size:13px;font-style:normal;font-variant:normal;font-weight:normal;font-stretch:normal;font-family:DejaVu Sans;-inkscape-font-specification:DejaVu Sans">IP</tspan></text>
    <rect
       ry="5"
       rx="5"
       y="597.56396"
       x="225"
       height="20"
       width="100"
       id="rect3179"
       style="fill:#fc8d59;fill-opacity:1;fill-rule:evenodd;stroke:none" />
    <text
       sodipodi:linespacing="125%"
       id="text3181"
       y="612.29614"
       x="263.18384"
       style="font-size:13px;font-style:normal;font-variant:normal;font-weight:normal;font-stretch:normal;line-height:125%;letter-spacing:0px;word-spacing:0px;fill:#000000;fill-opacity:1;stroke:none;font-family:DejaVu Sans;-inkscape-font-specification:DejaVu Sans"
       xml:space="preserve"><tspan
         style="font-size:13px;font-style:normal;font-variant:normal;font-weight:normal;font-stretch:normal;font-family:DejaVu Sans;-inkscape-font-specification:DejaVu Sans"
         y="612.29614"
         x="263.18384"
         id="tspan3183"
         sodipodi:role="line">TCP</tspan></text>
    <rect
       style="fill:#fee08b;fill-opacity:1;fill-rule:evenodd;stroke:none"
       id="rect3185"
       width="100"
       height="20"
       x="225"
       y="567.76575"
       rx="5"
       ry="5" />
    <text
       xml:space="preserve"
       style="font-size:13px;font-style:normal;font-variant:normal;font-weight:normal;font-stretch:normal;line-height:125%;letter-spacing:0px;word-spacing:0px;fill:#000000;fill-opacity:1;stroke:none;font-family:DejaVu Sans;-inkscape-font-specification:DejaVu Sans"
       x="263.66309"
       y="582.49792"
       id="text3187"
       sodipodi:linespacing="125%"><tspan
         sodipodi:role="line"
         id="tspan3189"
         x="263.66309"
         y="582.49792"
         style="font-size:13px;font-style:normal;font-variant:normal;font-weight:normal;font-stretch:normal;font-family:DejaVu Sans;-inkscape-font-specification:DejaVu Sans">TLS</tspan></text>
    <rect
       ry="5"
       rx="5"
       y="542.76575"
       x="225"
       height="20"
       width="100"
       id="rect3191"
       style="fill:#d9ef8b;fill-opacity:1;fill-rule:evenodd;stroke:none" />
    <text
       xml:space="preserve"
       style="font-size:18px;font-style:normal;font-variant:normal;font-weight:normal;font-stretch:normal;line-height:125%;letter-spacing:0px;word-spacing:0px;fill:#000000;fill-opacity:1;stroke:none;font-family:FreeSans;-inkscape-font-specification:FreeSans"
       x="223.06216"
       y="472.56396"
       id="text3209"
       sodipodi:linespacing="125%"><tspan
         sodipodi:role="line"
         id="tspan3211"
         x="223.06216"
         y="472.56396">Intermediate</tspan></text>
    <text
       sodipodi:linespacing="125%"
       id="text3231"
       y="472.56396"
       x="400"
       style="font-size:18px;font-style:normal;font-variant:normal;font-weight:normal;font-stretch:normal;line-height:125%;letter-spacing:0px;word-spacing:0px;fill:#000000;fill-opacity:1;stroke:none;font-family:FreeSans;-inkscape-font-specification:FreeSans"
       xml:space="preserve"><tspan
         y="472.56396"
         x="400"
         id="tspan3233"
         sodipodi:role="line">Previous</tspan></text>
    <rect
       style="fill:#d73027;fill-opacity:1;fill-rule:evenodd;stroke:none"
       id="rect3237"
       width="125"
       height="20"
       x="375"
       y="622.76575"
       rx="6.25"
       ry="5" />
    <text
       xml:space="preserve"
       style="font-size:13px;font-style:normal;font-variant:normal;font-weight:normal;font-stretch:normal;line-height:125%;letter-spacing:0px;word-spacing:0px;fill:#000000;fill-opacity:1;stroke:none;font-family:DejaVu Sans;-inkscape-font-specification:DejaVu Sans"
       x="431.24756"
       y="637.50427"
       id="text3239"
       sodipodi:linespacing="125%"><tspan
         sodipodi:role="line"
         id="tspan3241"
         x="431.24756"
         y="637.50427"
         style="font-size:13px;font-style:normal;font-variant:normal;font-weight:normal;font-stretch:normal;font-family:DejaVu Sans;-inkscape-font-specification:DejaVu Sans">IP</tspan></text>
    <rect
       ry="5"
       rx="6.25"
       y="597.76575"
       x="375"
       height="20"
       width="125"
       id="rect3243"
       style="fill:#fc8d59;fill-opacity:1;fill-rule:evenodd;stroke:none" />
    <text
       sodipodi:linespacing="125%"
       id="text3245"
       y="612.49792"
       x="425.68384"
       style="font-size:13px;font-style:normal;font-variant:normal;font-weight:normal;font-stretch:normal;line-height:125%;letter-spacing:0px;word-spacing:0px;fill:#000000;fill-opacity:1;stroke:none;font-family:DejaVu Sans;-inkscape-font-specification:DejaVu Sans"
       xml:space="preserve"><tspan
         style="font-size:13px;font-style:normal;font-variant:normal;font-weight:normal;font-stretch:normal;font-family:DejaVu Sans;-inkscape-font-specification:DejaVu Sans"
         y="612.49792"
         x="425.68384"
         id="tspan3247"
         sodipodi:role="line">TCP</tspan></text>
    <rect
       style="fill:#fee08b;fill-opacity:1;fill-rule:evenodd;stroke:none"
       id="rect3249"
       width="125"
       height="20"
       x="375"
       y="567.96753"
       rx="6.25"
       ry="5" />
    <text
       xml:space="preserve"
       style="font-size:13px;font-style:normal;font-variant:normal;font-weight:normal;font-stretch:normal;line-height:125%;letter-spacing:0px;word-spacing:0px;fill:#000000;fill-opacity:1;stroke:none;font-family:DejaVu Sans;-inkscape-font-specification:DejaVu Sans"
       x="426.16309"
       y="582.69971"
       id="text3251"
       sodipodi:linespacing="125%"><tspan
         sodipodi:role="line"
         id="tspan3253"
         x="426.16309"
         y="582.69971"
         style="font-size:13px;font-style:normal;font-variant:normal;font-weight:normal;font-stretch:normal;font-family:DejaVu Sans;-inkscape-font-specification:DejaVu Sans">TLS</tspan></text>
    <rect
       ry="5"
       rx="5"
       y="542.96753"
       x="375"
       height="20"
       width="100"
       id="rect3255"
       style="fill:#d9ef8b;fill-opacity:1;fill-rule:evenodd;stroke:none" />
    <text
       sodipodi:linespacing="125%"
       id="text3257"
       y="557.81396"
       x="403.84644"
       style="font-size:13px;font-style:normal;font-variant:normal;font-weight:normal;font-stretch:normal;line-height:125%;letter-spacing:0px;word-spacing:0px;fill:#000000;fill-opacity:1;stroke:none;font-family:DejaVu Sans;-inkscape-font-specification:DejaVu Sans"
       xml:space="preserve"><tspan
         style="font-size:13px;font-style:normal;font-variant:normal;font-weight:normal;font-stretch:normal;font-family:DejaVu Sans;-inkscape-font-specification:DejaVu Sans"
         y="557.81396"
         x="403.84644"
         id="tspan3259"
         sodipodi:role="line">Circuit</tspan></text>
    <rect
       style="fill:#91cf60;fill-opacity:1;fill-rule:evenodd;stroke:none"
       id="rect3261"
       width="100"
       height="20"
       x="375"
       y="517.96753"
       rx="5"
       ry="5" />
    <text
       xml:space="preserve"
       style="font-size:13px;font-style:normal;font-variant:normal;font-weight:normal;font-stretch:normal;line-height:125%;letter-spacing:0px;word-spacing:0px;fill:#000000;fill-opacity:1;stroke:none;font-family:DejaVu Sans;-inkscape-font-specification:DejaVu Sans"
       x="395.72778"
       y="532.81396"
       id="text3263"
       sodipodi:linespacing="125%"><tspan
         sodipodi:role="line"
         id="tspan3265"
         x="395.72778"
         y="532.81396"
         style="font-size:13px;font-style:normal;font-variant:normal;font-weight:normal;font-stretch:normal;font-family:DejaVu Sans;-inkscape-font-specification:DejaVu Sans">Cell Auth</tspan></text>
    <text
       sodipodi:linespacing="125%"
       id="text3269"
       y="506.354"
       x="418.49829"
       style="font-size:13px;font-style:normal;font-variant:normal;font-weight:normal;font-stretch:normal;line-height:125%;letter-spacing:0px;word-spacing:0px;fill:#000000;fill-opacity:1;stroke:none;font-family:DejaVu Sans;-inkscape-font-specification:DejaVu Sans"
       xml:space="preserve"><tspan
         style="font-size:13px;font-style:normal;font-variant:normal;font-weight:normal;font-stretch:normal;font-family:DejaVu Sans;-inkscape-font-specification:DejaVu Sans"
         y="506.354"
         x="418.49829"
         id="tspan3271"
         sodipodi:role="line">Setup</tspan></text>
    <rect
       ry="5"
       rx="5"
       y="622.56396"
       x="550"
       height="20"
       width="100"
       id="rect3275"
       style="fill:#d73027;fill-opacity:1;fill-rule:evenodd;stroke:none" />
    <text
       sodipodi:linespacing="125%"
       id="text3277"
       y="637.30249"
       x="593.74756"
       style="font-size:13px;font-style:normal;font-variant:normal;font-weight:normal;font-stretch:normal;line-height:125%;letter-spacing:0px;word-spacing:0px;fill:#000000;fill-opacity:1;stroke:none;font-family:DejaVu Sans;-inkscape-font-specification:DejaVu Sans"
       xml:space="preserve"><tspan
         style="font-size:13px;font-style:normal;font-variant:normal;font-weight:normal;font-stretch:normal;font-family:DejaVu Sans;-inkscape-font-specification:DejaVu Sans"
         y="637.30249"
         x="593.74756"
         id="tspan3279"
         sodipodi:role="line">IP</tspan></text>
    <rect
       style="fill:#fc8d59;fill-opacity:1;fill-rule:evenodd;stroke:none"
       id="rect3281"
       width="100"
       height="20"
       x="550"
       y="597.76575"
       rx="5"
       ry="5" />
    <text
       xml:space="preserve"
       style="font-size:13px;font-style:normal;font-variant:normal;font-weight:normal;font-stretch:normal;line-height:125%;letter-spacing:0px;word-spacing:0px;fill:#000000;fill-opacity:1;stroke:none;font-family:DejaVu Sans;-inkscape-font-specification:DejaVu Sans"
       x="588.18384"
       y="612.29614"
       id="text3283"
       sodipodi:linespacing="125%"><tspan
         sodipodi:role="line"
         id="tspan3285"
         x="588.18384"
         y="612.29614"
         style="font-size:13px;font-style:normal;font-variant:normal;font-weight:normal;font-stretch:normal;font-family:DejaVu Sans;-inkscape-font-specification:DejaVu Sans">TCP</tspan></text>
    <rect
       ry="5"
       rx="5"
       y="567.76575"
       x="550"
       height="20"
       width="100"
       id="rect3287"
       style="fill:#fee08b;fill-opacity:1;fill-rule:evenodd;stroke:none" />
    <text
       sodipodi:linespacing="125%"
       id="text3289"
       y="582.49792"
       x="588.66309"
       style="font-size:13px;font-style:normal;font-variant:normal;font-weight:normal;font-stretch:normal;line-height:125%;letter-spacing:0px;word-spacing:0px;fill:#000000;fill-opacity:1;stroke:none;font-family:DejaVu Sans;-inkscape-font-specification:DejaVu Sans"
       xml:space="preserve"><tspan
         style="font-size:13px;font-style:normal;font-variant:normal;font-weight:normal;font-stretch:normal;font-family:DejaVu Sans;-inkscape-font-specification:DejaVu Sans"
         y="582.49792"
         x="588.66309"
         id="tspan3291"
         sodipodi:role="line">TLS</tspan></text>
    <text
       xml:space="preserve"
       style="font-size:13px;font-style:normal;font-variant:normal;font-weight:normal;font-stretch:normal;line-height:125%;letter-spacing:0px;word-spacing:0px;fill:#000000;fill-opacity:1;stroke:none;font-family:DejaVu Sans;-inkscape-font-specification:DejaVu Sans"
       x="580.99829"
       y="506.23792"
       id="text3307"
       sodipodi:linespacing="125%"
       inkscape:transform-center-x="5.6730957"><tspan
         sodipodi:role="line"
         id="tspan3309"
         x="580.99829"
         y="506.23792"
         style="font-size:13px;font-style:normal;font-variant:normal;font-weight:normal;font-stretch:normal;font-family:DejaVu Sans;-inkscape-font-specification:DejaVu Sans">Setup</tspan></text>
    <text
       xml:space="preserve"
       style="font-size:18px;font-style:normal;font-variant:normal;font-weight:normal;font-stretch:normal;line-height:125%;letter-spacing:0px;word-spacing:0px;fill:#000000;fill-opacity:1;stroke:none;font-family:FreeSans;-inkscape-font-specification:FreeSans"
       x="579.29669"
       y="472.56396"
       id="text3311"
       sodipodi:linespacing="125%"><tspan
         sodipodi:role="line"
         id="tspan3313"
         x="579.29669"
         y="472.56396">Next</tspan></text>
    <path
       style="fill:none;stroke:#980101;stroke-width:1px;stroke-linecap:butt;stroke-linejoin:miter;stroke-opacity:1"
       d="m 190,632.96752 40,-0.20178 c 10,0 0,-80.20178 10,-80.20178 3.33333,0 10,0 10,0 m 50,0 10,0 c 10,0 0,80.20178 10,80.20178 l 35,0"
       id="path3379"
       inkscape:connector-curvature="0"
       sodipodi:nodetypes="cccccccc" />
    <text
       sodipodi:linespacing="125%"
       id="text3193"
       y="557.61218"
       x="253.84644"
       style="font-size:13px;font-style:normal;font-variant:normal;font-weight:normal;font-stretch:normal;line-height:125%;letter-spacing:0px;word-spacing:0px;fill:#000000;fill-opacity:1;stroke:none;font-family:DejaVu Sans;-inkscape-font-specification:DejaVu Sans"
       xml:space="preserve"><tspan
         style="font-size:13px;font-style:normal;font-variant:normal;font-weight:normal;font-stretch:normal;font-family:DejaVu Sans;-inkscape-font-specification:DejaVu Sans"
         y="557.61218"
         x="253.84644"
         id="tspan3195"
         sodipodi:role="line">Circuit</tspan></text>
    <path
       sodipodi:nodetypes="cccc"
       inkscape:connector-curvature="0"
       id="path3075"
       d="m 190,632.76574 -20,0 c -15,0 0,-130.20178 -15,-130.20178 l -10,0"
       style="fill:none;stroke:#980101;stroke-width:1px;stroke-linecap:butt;stroke-linejoin:miter;stroke-opacity:1" />
    <path
       sodipodi:nodetypes="cccc"
       inkscape:connector-curvature="0"
       id="path3076"
       d="m 355,632.76574 25,0 c 15,0 0,-130.20178 15,-130.20178 l 20,0"
       style="fill:none;stroke:#980101;stroke-width:1px;stroke-linecap:butt;stroke-linejoin:miter;stroke-opacity:1" />
    <path
       sodipodi:nodetypes="cccc"
       inkscape:connector-curvature="0"
       id="path3078"
       d="m 460,502.56396 20,0 c 15,0 0,130.20178 15,130.20178 l 20,0"
       style="fill:none;stroke:#980101;stroke-width:1px;stroke-linecap:butt;stroke-linejoin:miter;stroke-opacity:1" />
    <path
       sodipodi:nodetypes="cccc"
       inkscape:connector-curvature="0"
       id="path3080"
       d="m 515,632.76574 40,-0.20178 c 14.9707,0.20178 -0.0293,-129.79822 14.9707,-129.79822 l 5,0"
       style="fill:none;stroke:#980101;stroke-width:1px;stroke-linecap:butt;stroke-linejoin:miter;stroke-opacity:1" />
    <path
       style="fill:none;stroke:#000000;stroke-width:0.98782915;stroke-linecap:butt;stroke-linejoin:miter;stroke-miterlimit:4;stroke-opacity:1;stroke-dasharray:2.96348749, 2.96348749;stroke-dashoffset:0"
       d="m 45,592.76574 605,0"
       id="path3242"
       inkscape:connector-curvature="0" />
    <text
       sodipodi:linespacing="125%"
       id="text4012"
       y="585.76575"
       x="44.999996"
       style="font-size:10px;font-style:normal;font-variant:normal;font-weight:normal;font-stretch:normal;text-align:start;line-height:125%;letter-spacing:0px;word-spacing:0px;writing-mode:lr-tb;text-anchor:start;fill:#000000;fill-opacity:1;stroke:none;font-family:DejaVu Sans;-inkscape-font-specification:DejaVu Sans"
       xml:space="preserve"><tspan
         style="font-size:10px;font-style:normal;font-variant:normal;font-weight:normal;font-stretch:normal;text-align:start;line-height:125%;writing-mode:lr-tb;text-anchor:start;font-family:DejaVu Sans;-inkscape-font-specification:DejaVu Sans"
         y="585.76575"
         x="44.999996"
         id="tspan4014"
         sodipodi:role="line">Tor</tspan></text>
    <text
       xml:space="preserve"
       style="font-size:10px;font-style:normal;font-variant:normal;font-weight:normal;font-stretch:normal;text-align:start;line-height:125%;letter-spacing:0px;word-spacing:0px;writing-mode:lr-tb;text-anchor:start;fill:#000000;fill-opacity:1;stroke:none;font-family:DejaVu Sans;-inkscape-font-specification:DejaVu Sans"
       x="44.999996"
       y="605.76575"
       id="text4016"
       sodipodi:linespacing="125%"><tspan
         sodipodi:role="line"
         id="tspan4018"
         x="44.999996"
         y="605.76575"
         style="font-size:10px;font-style:normal;font-variant:normal;font-weight:normal;font-stretch:normal;text-align:start;line-height:125%;writing-mode:lr-tb;text-anchor:start;font-family:DejaVu Sans;-inkscape-font-specification:DejaVu Sans">Host</tspan></text>
  </g>
</svg>
