429, 458, 454, 520, 409, 440, 439, 501, 391, 422, 421, 482, 376, 404, 403, 463, 363, 389, 388, 446, 347, 374, 374, 429, 339, 363, 363, 414, 328, 353, 354, 401, 322, 344, 344, 390, 315, 336, 338, 382, 308, 329, 330, 372, 304, 323, 323, 365, 300, 320, 319, 359, 299, 315, 316, 354, 293, 308, 311, 349, 292, 309, 311, 346, 288, 305, 308, 340, 288, 303, 304, 340, 288, 303, 304, 340, 286, 300, 302, 338, 286, 302, 302, 337, 285, 302, 301, 339, 287, 299, 302, 337, 288, 301, 303, 339, 291, 303, 306, 342, 294, 306, 308, 345, 297, 309, 312, 349, 298, 312, 313, 351, 300, 313, 316, 355, 309, 322, 324, 365, 311, 327, 327, 373, 318, 334, 334, 381, 323, 339, 343, 393, 334, 349, 351, 402, 341, 359, 359, 413, 350, 367, 371, 427, 361, 382, 384, 442, 371, 396, 397, 459, 386, 409, 410, 476, 398, 427, 428, 491, 407, 441, 442, 507, 407, 430, 433, 524,
428, 457, 455, 516, 409, 439, 440, 490, 392, 423, 421, 472, 377, 405, 406, 454, 363, 390, 391, 434, 352, 377, 376, 418, 341, 364, 364, 404, 332, 354, 355, 393, 326, 346, 346, 382, 318, 338, 339, 373, 312, 331, 332, 364, 307, 325, 326, 357, 304, 320, 322, 351, 300, 315, 317, 345, 297, 312, 314, 339, 294, 309, 311, 337, 293, 307, 307, 334, 291, 305, 306, 331, 292, 304, 306, 330, 290, 303, 304, 329, 290, 302, 303, 329, 290, 302, 305, 329, 291, 303, 304, 330, 293, 305, 305, 332, 294, 307, 307, 335, 295, 307, 309, 336, 298, 312, 313, 341, 301, 314, 315, 345, 304, 320, 320, 351, 309, 323, 324, 357, 313, 329, 330, 363, 321, 336, 337, 372, 326, 342, 343, 382, 335, 350, 352, 392, 343, 360, 362, 404, 353, 371, 372, 417, 361, 384, 384, 430, 375, 399, 399, 449, 390, 414, 413, 466, 402, 429, 429, 484, 413, 443, 443, 504, 414, 445, 442, 520,
425, 455, 450, 504, 406, 432, 433, 480, 387, 414, 412, 460, 374, 398, 398, 441, 360, 382, 382, 423, 349, 370, 370, 407, 339, 359, 359, 395, 329, 349, 348, 382, 322, 341, 341, 373, 317, 333, 334, 365, 312, 327, 329, 356, 307, 321, 322, 349, 303, 317, 318, 344, 299, 312, 313, 337, 297, 309, 310, 333, 295, 305, 307, 330, 293, 303, 304, 326, 292, 301, 303, 323, 290, 299, 301, 322, 289, 299, 300, 320, 291, 299, 300, 321, 290, 298, 299, 320, 291, 300, 301, 322, 292, 301, 302, 322, 293, 302, 303, 326, 296, 305, 306, 330, 299, 308, 309, 333, 301, 311, 311, 337, 304, 315, 316, 343, 309, 319, 321, 350, 313, 325, 325, 355, 320, 331, 332, 365, 325, 338, 339, 374, 333, 346, 347, 383, 342, 356, 357, 395, 350, 367, 367, 408, 361, 378, 379, 422, 372, 390, 392, 437, 388, 406, 408, 455, 400, 421, 423, 472, 411, 436, 438, 494, 419, 444, 451, 517,
416, 443, 443, 492, 397, 423, 423, 471, 380, 405, 405, 448, 367, 389, 389, 430, 355, 376, 376, 414, 344, 363, 363, 401, 335, 353, 353, 389, 326, 344, 344, 375, 318, 335, 336, 367, 313, 327, 328, 357, 309, 322, 322, 349, 304, 316, 317, 341, 300, 311, 312, 335, 298, 308, 309, 330, 294, 304, 305, 326, 292, 300, 303, 321, 290, 298, 299, 317, 289, 296, 297, 315, 288, 295, 297, 314, 287, 293, 295, 311, 288, 295, 296, 313, 287, 295, 296, 313, 288, 294, 295, 314, 290, 297, 297, 316, 291, 298, 299, 319, 292, 299, 301, 321, 297, 302, 304, 326, 299, 306, 306, 330, 302, 310, 311, 335, 306, 314, 316, 342, 310, 319, 321, 348, 317, 326, 327, 357, 322, 333, 334, 367, 330, 340, 341, 375, 337, 351, 351, 387, 346, 359, 360, 400, 357, 372, 371, 414, 368, 384, 385, 429, 381, 398, 400, 447, 395, 415, 414, 465, 406, 428, 429, 483, 406, 433, 441, 502,
407, 433, 432, 482, 389, 414, 414, 459, 374, 398, 399, 441, 360, 383, 383, 422, 350, 369, 369, 407, 340, 358, 358, 393, 330, 347, 347, 381, 321, 338, 339, 369, 316, 330, 330, 360, 308, 323, 323, 349, 304, 316, 318, 342, 299, 311, 312, 334, 296, 306, 308, 328, 293, 302, 303, 323, 291, 300, 301, 319, 287, 296, 296, 314, 286, 293, 294, 310, 286, 292, 292, 308, 284, 290, 292, 306, 283, 288, 290, 305, 283, 289, 290, 305, 283, 289, 290, 305, 285, 290, 292, 305, 286, 291, 292, 308, 287, 292, 294, 311, 289, 295, 297, 314, 292, 298, 299, 319, 294, 300, 301, 323, 300, 305, 306, 329, 304, 310, 311, 335, 307, 315, 315, 342, 315, 322, 322, 352, 319, 328, 329, 359, 326, 336, 336, 370, 334, 346, 347, 381, 343, 355, 355, 393, 352, 366, 367, 406, 363, 378, 379, 420, 375, 391, 392, 438, 388, 404, 406, 453, 398, 420, 420, 474, 413, 412, 427, 493,
400, 427, 423, 471, 383, 408, 407, 451, 367, 392, 391, 431, 354, 376, 377, 413, 344, 363, 363, 399, 334, 352, 353, 386, 326, 342, 342, 372, 318, 333, 334, 361, 310, 325, 326, 352, 305, 317, 319, 342, 301, 312, 313, 335, 295, 307, 307, 328, 293, 303, 303, 322, 290, 299, 299, 317, 288, 295, 296, 311, 285, 291, 293, 307, 283, 289, 291, 304, 282, 286, 288, 301, 281, 285, 287, 299, 279, 285, 286, 298, 281, 284, 285, 298, 280, 284, 286, 297, 281, 284, 287, 299, 283, 285, 288, 301, 285, 288, 290, 305, 286, 290, 292, 307, 289, 294, 295, 312, 292, 298, 298, 316, 295, 300, 301, 321, 301, 306, 307, 330, 303, 311, 311, 335, 309, 319, 318, 344, 315, 324, 325, 353, 320, 331, 332, 361, 328, 339, 340, 372, 335, 350, 350, 386, 345, 359, 360, 398, 355, 372, 372, 411, 366, 384, 383, 427, 379, 400, 398, 445, 393, 414, 413, 464, 390, 416, 427, 485,
395, 416, 416, 465, 376, 400, 400, 441, 361, 386, 385, 426, 350, 372, 372, 407, 339, 359, 359, 393, 331, 349, 349, 380, 322, 338, 340, 368, 313, 330, 330, 356, 307, 323, 322, 346, 303, 315, 316, 337, 296, 308, 309, 328, 293, 303, 304, 323, 289, 298, 299, 315, 288, 295, 295, 310, 284, 290, 290, 305, 281, 287, 287, 300, 278, 284, 285, 297, 279, 283, 284, 294, 278, 282, 283, 292, 277, 279, 281, 290, 277, 280, 281, 291, 277, 279, 281, 290, 278, 281, 282, 292, 279, 283, 283, 294, 280, 283, 283, 297, 284, 286, 288, 301, 287, 289, 291, 305, 289, 294, 294, 310, 292, 297, 298, 314, 296, 302, 303, 322, 300, 308, 308, 329, 306, 313, 313, 338, 311, 320, 322, 347, 317, 326, 327, 357, 325, 335, 337, 366, 332, 345, 345, 379, 340, 354, 354, 389, 351, 365, 365, 405, 364, 377, 377, 420, 373, 390, 391, 435, 388, 405, 404, 456, 384, 402, 422, 464,
389, 411, 411, 456, 372, 394, 395, 436, 358, 380, 379, 419, 348, 367, 367, 403, 334, 354, 355, 386, 326, 344, 344, 374, 318, 335, 335, 363, 312, 326, 326, 351, 305, 318, 319, 341, 299, 312, 312, 333, 294, 306, 305, 324, 291, 299, 300, 317, 287, 295, 295, 310, 283, 290, 291, 303, 279, 287, 286, 299, 280, 284, 285, 295, 277, 281, 281, 291, 275, 278, 279, 287, 275, 277, 278, 286, 274, 276, 276, 284, 274, 274, 276, 284, 274, 276, 276, 284, 275, 277, 278, 286, 277, 278, 279, 288, 279, 279, 281, 291, 281, 283, 284, 295, 283, 287, 287, 299, 287, 291, 291, 306, 291, 293, 295, 311, 294, 299, 299, 318, 297, 304, 304, 324, 303, 311, 310, 332, 309, 317, 316, 341, 317, 324, 323, 350, 321, 332, 332, 362, 329, 341, 340, 375, 338, 351, 350, 386, 347, 361, 361, 400, 358, 373, 373, 415, 372, 387, 386, 433, 383, 399, 399, 450, 397, 404, 417, 474,
384, 406, 409, 449, 367, 389, 390, 429, 354, 376, 376, 413, 343, 363, 363, 397, 332, 351, 352, 382, 324, 342, 341, 371, 316, 332, 332, 358, 309, 323, 324, 347, 302, 316, 316, 336, 296, 308, 309, 328, 293, 302, 302, 318, 289, 296, 296, 311, 285, 292, 292, 305, 282, 287, 287, 300, 280, 283, 283, 294, 276, 280, 280, 289, 274, 277, 277, 285, 273, 275, 275, 282, 271, 272, 274, 280, 270, 271, 272, 278, 270, 272, 273, 279, 272, 271, 273, 279, 273, 273, 274, 280, 274, 275, 276, 283, 277, 276, 277, 286, 279, 280, 281, 289, 281, 283, 284, 294, 284, 287, 287, 299, 288, 290, 291, 304, 291, 296, 296, 312, 296, 301, 301, 318, 300, 308, 306, 327, 306, 314, 313, 338, 312, 319, 320, 346, 319, 328, 328, 357, 325, 336, 336, 368, 335, 346, 346, 381, 343, 358, 356, 395, 354, 368, 368, 408, 367, 382, 382, 424, 377, 394, 394, 443, 380, 402, 400, 460,
379, 398, 399, 440, 364, 386, 387, 424, 350, 372, 372, 407, 341, 359, 359, 391, 330, 349, 350, 379, 321, 338, 339, 366, 312, 329, 329, 353, 306, 321, 320, 341, 300, 313, 313, 332, 295, 306, 306, 323, 291, 300, 299, 315, 287, 294, 294, 307, 282, 288, 288, 301, 279, 284, 284, 295, 276, 280, 281, 288, 273, 276, 277, 283, 271, 273, 274, 280, 270, 271, 271, 277, 269, 270, 270, 274, 268, 269, 270, 273, 268, 268, 269, 273, 268, 268, 270, 273, 270, 270, 270, 274, 270, 271, 272, 277, 273, 273, 274, 280, 276, 277, 277, 284, 279, 281, 281, 290, 282, 283, 284, 293, 285, 287, 288, 300, 290, 292, 292, 307, 294, 299, 298, 314, 299, 304, 303, 322, 304, 310, 309, 331, 310, 317, 317, 341, 316, 324, 325, 351, 324, 334, 333, 364, 333, 344, 343, 377, 341, 353, 352, 390, 350, 365, 366, 405, 360, 376, 377, 419, 374, 390, 390, 438, 369, 396, 402, 445,
377, 397, 398, 439, 360, 383, 385, 419, 348, 370, 369, 403, 338, 358, 357, 388, 327, 347, 347, 375, 319, 336, 336, 362, 311, 326, 326, 349, 304, 317, 317, 337, 298, 311, 310, 328, 293, 304, 303, 319, 290, 297, 296, 310, 284, 291, 291, 304, 281, 286, 286, 296, 276, 282, 281, 290, 275, 277, 277, 284, 271, 274, 274, 279, 269, 271, 272, 276, 267, 269, 269, 273, 267, 267, 268, 271, 264, 265, 266, 269, 265, 265, 266, 268, 266, 265, 266, 269, 266, 267, 268, 270, 269, 268, 269, 272, 270, 270, 271, 275, 273, 273, 273, 278, 276, 278, 278, 285, 280, 281, 282, 290, 283, 285, 286, 296, 287, 291, 290, 303, 293, 296, 295, 311, 296, 301, 300, 318, 301, 308, 307, 328, 307, 315, 313, 337, 313, 322, 322, 348, 321, 331, 331, 360, 329, 341, 340, 373, 340, 352, 351, 387, 348, 363, 363, 400, 360, 373, 374, 417, 369, 387, 387, 434, 367, 389, 387, 453,
373, 394, 395, 436, 359, 381, 382, 418, 345, 367, 367, 402, 335, 355, 355, 386, 325, 343, 345, 371, 317, 334, 333, 359, 309, 325, 325, 348, 302, 316, 316, 336, 297, 308, 308, 325, 292, 303, 301, 316, 287, 296, 295, 307, 282, 290, 288, 299, 280, 285, 284, 293, 276, 279, 280, 286, 272, 274, 274, 281, 268, 270, 271, 275, 267, 268, 268, 272, 264, 266, 266, 268, 264, 264, 265, 267, 263, 263, 263, 265, 263, 263, 263, 264, 263, 263, 264, 265, 264, 264, 264, 266, 265, 265, 266, 268, 268, 267, 268, 271, 270, 271, 271, 277, 274, 275, 275, 280, 279, 279, 279, 286, 282, 283, 283, 292, 284, 288, 288, 298, 290, 293, 292, 306, 295, 299, 298, 315, 300, 307, 305, 324, 306, 312, 312, 333, 311, 321, 320, 345, 319, 329, 328, 357, 328, 339, 338, 370, 334, 348, 348, 383, 344, 361, 359, 398, 357, 371, 371, 414, 365, 384, 385, 430, 367, 387, 396, 443,
373, 393, 397, 433, 357, 380, 380, 416, 345, 365, 366, 400, 334, 352, 354, 384, 324, 343, 343, 371, 316, 333, 333, 357, 309, 323, 323, 345, 301, 315, 314, 332, 296, 307, 307, 323, 292, 301, 299, 314, 286, 294, 292, 304, 281, 288, 287, 297, 278, 284, 281, 290, 274, 279, 278, 284, 271, 274, 273, 278, 267, 269, 269, 272, 265, 266, 266, 268, 263, 264, 264, 265, 262, 262, 263, 264, 261, 261, 261, 262, 261, 261, 262, 262, 261, 261, 262, 262, 262, 261, 262, 263, 265, 263, 264, 265, 266, 266, 267, 269, 268, 269, 269, 273, 273, 273, 273, 278, 276, 277, 277, 284, 279, 281, 281, 290, 284, 286, 285, 296, 288, 292, 291, 304, 294, 298, 297, 313, 298, 305, 304, 323, 304, 311, 310, 332, 311, 319, 318, 344, 317, 328, 327, 355, 327, 337, 338, 368, 334, 348, 346, 381, 344, 359, 359, 396, 355, 370, 370, 410, 366, 384, 382, 429, 369, 379, 394, 450,
370, 391, 397, 433, 357, 379, 379, 413, 344, 364, 366, 398, 335, 352, 355, 382, 325, 342, 342, 368, 316, 332, 332, 356, 308, 323, 323, 343, 301, 313, 312, 332, 296, 307, 305, 322, 289, 299, 299, 310, 286, 293, 292, 304, 281, 287, 286, 295, 277, 281, 281, 288, 273, 277, 276, 282, 270, 273, 271, 275, 267, 268, 268, 270, 265, 266, 265, 266, 262, 262, 263, 263, 262, 261, 261, 262, 261, 260, 260, 260, 260, 260, 260, 260, 260, 260, 260, 260, 262, 261, 261, 261, 263, 262, 263, 264, 265, 265, 264, 266, 268, 267, 268, 271, 271, 272, 270, 276, 275, 275, 275, 281, 279, 281, 280, 287, 284, 285, 285, 295, 288, 291, 290, 303, 292, 298, 296, 311, 297, 304, 303, 320, 304, 310, 310, 329, 309, 319, 319, 342, 317, 328, 327, 354, 325, 337, 335, 367, 333, 346, 346, 380, 343, 359, 358, 395, 354, 369, 370, 410, 364, 382, 383, 428, 372, 380, 384, 456,
371, 392, 393, 433, 356, 378, 380, 413, 343, 364, 365, 396, 334, 353, 352, 382, 325, 342, 343, 368, 316, 332, 331, 355, 308, 322, 321, 342, 301, 314, 313, 330, 295, 307, 306, 322, 291, 300, 299, 311, 286, 294, 292, 302, 280, 287, 286, 294, 277, 281, 281, 287, 272, 276, 276, 280, 269, 271, 271, 274, 266, 267, 267, 268, 264, 265, 264, 266, 261, 261, 261, 262, 261, 261, 260, 260, 259, 259, 259, 258, 260, 259, 259, 259, 260, 259, 259, 259, 261, 260, 260, 260, 263, 261, 261, 263, 266, 264, 264, 266, 268, 267, 267, 270, 271, 270, 271, 274, 274, 275, 275, 280, 279, 280, 279, 287, 283, 285, 285, 293, 287, 290, 289, 302, 293, 297, 296, 310, 297, 304, 303, 319, 305, 311, 310, 330, 310, 319, 319, 342, 316, 327, 326, 355, 324, 336, 336, 366, 333, 348, 347, 380, 344, 358, 358, 395, 354, 370, 369, 410, 364, 382, 383, 427, 366, 384, 395, 446,
374, 392, 394, 433, 356, 379, 379, 413, 343, 364, 365, 398, 335, 353, 353, 382, 325, 342, 343, 368, 316, 334, 333, 356, 309, 324, 322, 344, 301, 316, 314, 332, 296, 309, 307, 322, 290, 300, 300, 312, 286, 294, 292, 302, 281, 287, 286, 295, 276, 282, 280, 286, 273, 277, 276, 280, 269, 272, 271, 275, 266, 268, 267, 269, 264, 264, 264, 264, 261, 262, 262, 263, 260, 260, 260, 260, 258, 260, 259, 259, 259, 259, 258, 259, 259, 260, 259, 259, 261, 260, 260, 261, 263, 262, 262, 263, 265, 264, 264, 266, 267, 267, 266, 270, 272, 271, 271, 274, 274, 275, 275, 280, 279, 280, 279, 285, 283, 285, 284, 293, 288, 291, 290, 301, 292, 298, 296, 310, 298, 304, 304, 320, 304, 312, 310, 331, 311, 319, 319, 343, 319, 328, 327, 355, 326, 338, 337, 367, 334, 347, 346, 381, 343, 358, 358, 395, 356, 370, 371, 412, 365, 382, 383, 428, 367, 388, 389, 451,
376, 396, 394, 438, 359, 379, 382, 417, 347, 367, 368, 401, 336, 354, 355, 384, 327, 344, 345, 370, 317, 335, 334, 357, 310, 325, 325, 345, 302, 316, 316, 333, 297, 309, 307, 322, 291, 303, 301, 314, 287, 296, 294, 305, 282, 288, 288, 295, 277, 283, 281, 288, 272, 277, 276, 280, 270, 271, 271, 274, 266, 268, 268, 270, 265, 264, 265, 265, 262, 262, 262, 263, 260, 261, 262, 262, 260, 260, 260, 259, 260, 260, 259, 260, 260, 260, 260, 260, 260, 260, 260, 260, 263, 262, 262, 262, 266, 264, 265, 266, 269, 268, 268, 270, 273, 273, 271, 275, 276, 276, 275, 281, 278, 281, 279, 287, 284, 286, 285, 295, 289, 291, 291, 302, 293, 298, 297, 310, 299, 305, 304, 321, 304, 313, 311, 331, 312, 320, 319, 343, 319, 330, 329, 356, 327, 339, 338, 368, 334, 348, 349, 382, 344, 360, 360, 397, 356, 372, 372, 413, 367, 383, 385, 432, 364, 377, 399, 449,
376, 398, 398, 439, 360, 382, 385, 419, 348, 369, 370, 402, 338, 357, 358, 387, 328, 347, 347, 373, 319, 337, 336, 359, 311, 327, 327, 346, 304, 318, 318, 336, 298, 310, 309, 325, 293, 303, 302, 314, 288, 297, 295, 305, 283, 290, 288, 296, 278, 283, 282, 288, 273, 278, 276, 282, 270, 273, 273, 276, 267, 269, 268, 271, 265, 266, 266, 267, 263, 263, 263, 264, 261, 262, 262, 261, 261, 260, 260, 261, 261, 260, 260, 261, 261, 261, 261, 261, 262, 261, 262, 262, 264, 264, 264, 265, 268, 266, 266, 268, 269, 269, 269, 272, 272, 273, 273, 277, 276, 278, 276, 283, 281, 282, 281, 288, 285, 288, 287, 296, 289, 294, 292, 305, 295, 301, 299, 313, 300, 307, 306, 324, 307, 314, 312, 335, 312, 323, 322, 345, 319, 331, 330, 357, 328, 341, 339, 371, 337, 352, 351, 386, 346, 362, 362, 400, 356, 372, 374, 415, 367, 386, 385, 434, 377, 398, 410, 453,
376, 400, 403, 439, 362, 386, 388, 421, 350, 372, 373, 404, 338, 360, 360, 389, 331, 350, 351, 376, 321, 340, 338, 361, 313, 330, 328, 348, 305, 320, 319, 337, 299, 312, 310, 326, 294, 305, 303, 318, 289, 298, 297, 308, 283, 291, 290, 297, 280, 285, 284, 291, 275, 279, 278, 284, 272, 274, 273, 278, 268, 270, 271, 272, 267, 268, 267, 269, 264, 265, 264, 266, 263, 263, 263, 263, 261, 262, 262, 263, 261, 263, 263, 263, 263, 263, 262, 263, 263, 264, 264, 264, 266, 266, 266, 267, 268, 268, 268, 270, 270, 271, 271, 273, 274, 276, 275, 279, 278, 280, 278, 284, 282, 284, 284, 291, 287, 290, 289, 298, 291, 296, 294, 306, 296, 303, 301, 315, 302, 310, 308, 326, 308, 317, 315, 336, 314, 325, 324, 347, 321, 333, 333, 359, 330, 343, 342, 373, 339, 354, 352, 387, 348, 365, 365, 403, 359, 377, 378, 419, 369, 390, 390, 435, 369, 389, 396, 464,
382, 407, 406, 447, 367, 391, 392, 425, 351, 376, 376, 409, 342, 363, 364, 392, 333, 351, 354, 378, 323, 341, 342, 366, 315, 333, 331, 353, 308, 324, 322, 340, 301, 316, 313, 330, 296, 307, 306, 320, 290, 300, 298, 310, 286, 293, 291, 302, 281, 287, 286, 294, 277, 283, 281, 288, 274, 277, 277, 281, 270, 273, 272, 276, 268, 270, 271, 272, 266, 267, 267, 268, 265, 266, 266, 267, 263, 265, 265, 266, 264, 266, 265, 265, 265, 266, 266, 266, 265, 266, 267, 266, 267, 268, 269, 270, 271, 271, 271, 274, 272, 274, 274, 276, 277, 278, 278, 283, 280, 282, 282, 288, 284, 287, 286, 295, 289, 293, 292, 303, 293, 299, 298, 310, 299, 306, 304, 320, 304, 313, 311, 328, 310, 321, 319, 340, 317, 328, 327, 351, 324, 337, 337, 364, 333, 346, 346, 378, 341, 358, 357, 393, 352, 369, 367, 409, 362, 381, 380, 423, 373, 394, 393, 442, 366, 407, 396, 461,
386, 409, 410, 451, 369, 394, 394, 429, 356, 381, 379, 412, 344, 367, 368, 397, 334, 356, 356, 383, 325, 345, 344, 368, 318, 334, 333, 356, 309, 324, 323, 343, 303, 318, 315, 332, 298, 310, 308, 323, 292, 302, 300, 313, 287, 296, 295, 305, 283, 290, 288, 298, 278, 286, 284, 291, 276, 280, 279, 286, 273, 276, 276, 279, 270, 274, 272, 276, 269, 271, 270, 272, 268, 270, 270, 271, 266, 268, 268, 269, 266, 268, 268, 270, 268, 269, 269, 269, 268, 270, 269, 272, 270, 272, 271, 274, 273, 274, 274, 277, 275, 277, 277, 281, 278, 281, 281, 286, 283, 286, 285, 292, 287, 290, 290, 299, 291, 296, 295, 306, 296, 302, 301, 315, 301, 310, 307, 324, 305, 316, 315, 333, 313, 324, 321, 345, 320, 331, 331, 356, 326, 340, 339, 368, 336, 351, 350, 382, 343, 362, 360, 397, 354, 372, 372, 412, 365, 385, 384, 427, 376, 398, 398, 446, 383, 403, 399, 472,
390, 415, 416, 459, 374, 400, 400, 436, 359, 385, 384, 419, 347, 371, 370, 402, 337, 358, 358, 387, 329, 349, 347, 375, 320, 338, 338, 361, 312, 329, 327, 348, 308, 320, 319, 338, 302, 314, 312, 328, 296, 306, 304, 318, 291, 300, 298, 309, 286, 294, 292, 303, 282, 288, 287, 296, 279, 285, 284, 290, 276, 280, 280, 284, 273, 277, 276, 281, 272, 275, 274, 277, 271, 273, 273, 274, 269, 272, 272, 274, 270, 271, 272, 274, 269, 272, 272, 275, 271, 274, 274, 276, 275, 276, 276, 279, 276, 278, 278, 283, 279, 282, 281, 287, 282, 286, 285, 292, 285, 290, 289, 297, 290, 295, 294, 305, 294, 300, 300, 312, 299, 305, 304, 321, 306, 313, 311, 329, 310, 321, 319, 339, 316, 328, 326, 349, 323, 337, 335, 363, 331, 346, 343, 374, 338, 355, 355, 386, 348, 366, 364, 401, 358, 377, 377, 417, 370, 392, 391, 435, 382, 404, 404, 453, 381, 409, 408, 474,
393, 423, 424, 465, 378, 404, 404, 443, 364, 389, 389, 423, 352, 376, 375, 409, 340, 363, 362, 393, 331, 352, 351, 379, 324, 341, 340, 366, 316, 333, 332, 354, 310, 325, 323, 344, 303, 318, 316, 334, 298, 311, 309, 324, 294, 304, 303, 316, 289, 298, 296, 308, 285, 294, 293, 302, 282, 290, 288, 296, 279, 284, 284, 290, 276, 281, 281, 286, 275, 279, 279, 283, 274, 277, 277, 281, 274, 277, 277, 280, 273, 276, 276, 280, 275, 277, 277, 280, 276, 279, 278, 282, 277, 281, 280, 285, 280, 283, 284, 289, 284, 287, 286, 293, 285, 290, 290, 297, 289, 294, 294, 303, 294, 299, 298, 310, 297, 304, 304, 318, 302, 311, 310, 326, 307, 318, 316, 334, 314, 324, 324, 344, 320, 332, 331, 355, 327, 342, 339, 367, 334, 351, 348, 381, 344, 362, 360, 394, 352, 371, 371, 408, 364, 384, 382, 423, 377, 397, 397, 441, 387, 411, 410, 460, 387, 415, 424, 491,
403, 427, 423, 472, 384, 411, 410, 451, 370, 395, 395, 434, 357, 381, 380, 417, 346, 369, 368, 399, 335, 357, 356, 386, 326, 348, 346, 373, 321, 338, 336, 361, 313, 331, 328, 352, 307, 322, 322, 340, 301, 315, 314, 331, 297, 309, 308, 322, 293, 304, 301, 316, 289, 298, 296, 308, 286, 293, 293, 302, 282, 289, 290, 296, 281, 287, 285, 293, 279, 284, 284, 290, 278, 283, 283, 288, 278, 282, 282, 286, 278, 283, 283, 287, 279, 282, 283, 288, 279, 283, 284, 288, 282, 285, 285, 292, 284, 288, 288, 296, 288, 291, 291, 300, 291, 297, 296, 306, 293, 301, 299, 311, 298, 305, 304, 318, 302, 310, 309, 325, 305, 316, 315, 333, 312, 323, 320, 341, 318, 329, 328, 352, 325, 337, 336, 361, 332, 347, 344, 373, 340, 357, 355, 388, 350, 366, 365, 402, 358, 379, 376, 417, 368, 391, 389, 432, 381, 403, 404, 449, 394, 418, 417, 468, 393, 417, 422, 501,
406, 437, 434, 480, 388, 420, 417, 458, 372, 402, 401, 441, 360, 388, 387, 423, 350, 375, 374, 406, 339, 363, 362, 393, 332, 352, 351, 379, 323, 344, 342, 367, 316, 337, 334, 358, 308, 328, 326, 347, 304, 321, 318, 337, 301, 315, 314, 329, 295, 308, 306, 321, 292, 304, 302, 316, 289, 299, 298, 310, 287, 295, 295, 304, 285, 293, 292, 300, 283, 290, 290, 298, 283, 289, 290, 297, 282, 289, 288, 295, 282, 288, 289, 295, 283, 289, 289, 296, 284, 291, 291, 297, 286, 292, 293, 301, 288, 295, 294, 304, 291, 298, 298, 308, 295, 303, 302, 314, 298, 307, 306, 319, 302, 312, 310, 325, 305, 316, 315, 331, 310, 322, 321, 340, 316, 329, 326, 349, 322, 336, 335, 360, 330, 346, 343, 371, 336, 353, 352, 383, 344, 363, 362, 396, 354, 374, 372, 408, 364, 385, 382, 424, 376, 399, 398, 441, 388, 411, 410, 458, 398, 427, 425, 478, 403, 437, 437, 507,
414, 447, 443, 483, 395, 426, 425, 468, 379, 411, 409, 449, 366, 395, 394, 432, 354, 383, 381, 416, 344, 371, 368, 402, 334, 360, 359, 387, 328, 351, 348, 375, 320, 342, 339, 366, 314, 333, 331, 355, 309, 326, 324, 345, 305, 319, 318, 336, 300, 314, 312, 330, 298, 310, 309, 323, 294, 306, 304, 318, 292, 302, 302, 312, 289, 299, 298, 309, 289, 297, 297, 307, 289, 296, 296, 306, 287, 295, 295, 304, 288, 296, 295, 305, 289, 296, 296, 305, 289, 297, 298, 306, 292, 299, 299, 309, 294, 302, 302, 313, 296, 305, 305, 318, 300, 309, 309, 322, 303, 313, 312, 327, 308, 317, 316, 334, 312, 322, 321, 341, 316, 329, 328, 348, 321, 337, 334, 358, 327, 343, 342, 369, 335, 350, 350, 380, 344, 360, 359, 391, 350, 372, 369, 404, 360, 381, 380, 419, 370, 392, 392, 433, 380, 406, 405, 449, 396, 420, 419, 467, 406, 434, 433, 486, 411, 435, 445, 507,
427, 461, 456, 493, 404, 437, 436, 481, 386, 419, 417, 461, 373, 404, 401, 441, 361, 391, 389, 425, 349, 378, 378, 411, 341, 367, 365, 397, 333, 357, 356, 385, 324, 349, 345, 374, 319, 340, 338, 363, 314, 332, 330, 354, 309, 327, 325, 347, 305, 321, 320, 340, 303, 317, 315, 334, 299, 314, 312, 328, 298, 308, 308, 323, 294, 306, 305, 319, 294, 305, 303, 317, 294, 303, 304, 316, 293, 304, 304, 314, 295, 304, 305, 315, 295, 304, 305, 317, 295, 306, 307, 316, 298, 307, 306, 319, 299, 309, 309, 322, 302, 313, 312, 327, 305, 316, 316, 331, 309, 320, 320, 338, 313, 325, 324, 343, 318, 330, 330, 351, 321, 336, 335, 358, 328, 343, 341, 368, 334, 352, 350, 379, 341, 358, 357, 388, 351, 368, 367, 403, 358, 379, 377, 415, 367, 389, 388, 429, 377, 402, 400, 446, 391, 418, 415, 464, 403, 431, 429, 479, 416, 448, 444, 500, 435, 466, 466, 547,
444, 478, 472, 502, 413, 448, 447, 489, 392, 430, 426, 472, 379, 413, 411, 454, 367, 397, 396, 434, 355, 385, 384, 422, 347, 374, 372, 408, 336, 363, 362, 396, 331, 355, 353, 384, 325, 346, 345, 374, 319, 340, 339, 365, 314, 334, 333, 356, 310, 328, 327, 348, 307, 324, 323, 344, 304, 321, 319, 339, 303, 317, 316, 333, 302, 314, 315, 330, 299, 313, 313, 327, 299, 312, 313, 325, 300, 312, 312, 325, 300, 311, 312, 326, 299, 312, 311, 324, 301, 312, 313, 327, 303, 315, 315, 330, 306, 317, 318, 333, 308, 320, 321, 336, 311, 325, 323, 341, 315, 328, 327, 347, 318, 332, 332, 354, 324, 338, 337, 361, 326, 345, 342, 369, 333, 350, 350, 379, 340, 359, 357, 391, 349, 367, 366, 400, 356, 377, 375, 412, 366, 389, 388, 427, 374, 400, 398, 439, 385, 413, 410, 456, 397, 426, 424, 476, 413, 443, 442, 491, 426, 459, 458, 513, 422, 472, 464, 534,
459, 498, 494, 522, 422, 463, 460, 504, 402, 442, 436, 485, 386, 423, 421, 466, 373, 406, 405, 449, 360, 392, 390, 431, 352, 380, 379, 418, 344, 371, 370, 405, 337, 364, 362, 395, 331, 357, 355, 386, 325, 349, 347, 376, 320, 342, 341, 366, 316, 337, 334, 362, 312, 332, 330, 354, 312, 328, 328, 350, 310, 326, 325, 345, 308, 325, 323, 342, 306, 323, 322, 339, 305, 322, 320, 338, 306, 320, 320, 337, 307, 320, 321, 336, 309, 321, 321, 337, 308, 322, 322, 338, 310, 323, 323, 342, 312, 325, 325, 344, 315, 329, 329, 349, 318, 334, 333, 354, 322, 338, 336, 359, 325, 341, 341, 366, 330, 346, 346, 372, 335, 352, 351, 380, 342, 361, 359, 390, 347, 370, 368, 401, 355, 378, 376, 413, 365, 389, 387, 425, 374, 399, 397, 440, 383, 411, 409, 452, 393, 423, 424, 469, 408, 440, 437, 489, 422, 456, 453, 507, 436, 473, 471, 530, 439, 471, 474, 560,
480, 523, 512, 544, 435, 479, 475, 522, 410, 449, 445, 501, 396, 431, 429, 479, 382, 414, 413, 464, 370, 401, 399, 445, 362, 392, 390, 432, 351, 382, 381, 419, 344, 375, 372, 409, 338, 366, 364, 398, 333, 358, 356, 387, 328, 351, 350, 381, 325, 345, 345, 374, 321, 341, 341, 366, 320, 339, 338, 363, 317, 335, 336, 358, 314, 335, 333, 353, 314, 332, 330, 352, 314, 330, 330, 351, 313, 329, 329, 349, 315, 329, 329, 349, 314, 329, 329, 350, 316, 331, 329, 352, 317, 331, 331, 353, 318, 336, 334, 356, 322, 338, 337, 360, 325, 342, 341, 366, 328, 345, 344, 370, 333, 350, 349, 376, 338, 355, 354, 384, 342, 364, 362, 394, 349, 371, 370, 404, 357, 380, 378, 415, 363, 389, 386, 425, 371, 399, 397, 439, 381, 411, 409, 453, 393, 424, 421, 469, 404, 436, 434, 483, 422, 454, 450, 504, 435, 469, 466, 522, 447, 485, 485, 545, 464, 493, 493, 571,
492, 542, 536, 566, 447, 488, 485, 537, 418, 458, 453, 515, 404, 440, 437, 494, 392, 425, 423, 477, 380, 415, 413, 463, 370, 405, 401, 450, 361, 394, 392, 434, 354, 386, 383, 423, 348, 375, 375, 411, 343, 367, 365, 402, 337, 362, 360, 395, 333, 356, 353, 387, 331, 353, 353, 382, 327, 351, 349, 376, 326, 347, 346, 372, 322, 343, 343, 369, 321, 341, 339, 365, 323, 339, 339, 363, 321, 338, 337, 362, 321, 338, 338, 362, 323, 339, 338, 364, 322, 340, 339, 364, 325, 342, 342, 365, 327, 345, 344, 370, 331, 349, 347, 374, 333, 351, 350, 379, 336, 354, 353, 384, 342, 361, 361, 391, 346, 368, 366, 400, 350, 375, 373, 409, 360, 381, 380, 417, 366, 389, 388, 430, 373, 401, 398, 443, 382, 411, 408, 454, 393, 422, 419, 469, 404, 435, 432, 484, 418, 448, 445, 501, 433, 465, 461, 522, 446, 482, 480, 540, 461, 499, 496, 563, 470, 512, 513, 578,
477, 549, 532, 534, 446, 506, 502, 552, 449, 461, 465, 532, 407, 443, 449, 527, 393, 440, 449, 505, 389, 431, 459, 486, 375, 437, 426, 461, 391, 419, 418, 452, 370, 389, 389, 440, 357, 388, 377, 435, 360, 373, 378, 426, 338, 376, 373, 401, 345, 373, 380, 403, 347, 386, 367, 399, 345, 364, 370, 403, 327, 364, 357, 394, 339, 356, 352, 394, 344, 356, 349, 382, 328, 358, 347, 385, 333, 355, 346, 386, 332, 356, 355, 386, 330, 343, 348, 374, 341, 353, 350, 375, 333, 351, 348, 385, 345, 358, 360, 401, 326, 353, 361, 390, 347, 366, 371, 404, 341, 355, 368, 405, 359, 394, 377, 424, 372, 388, 392, 416, 361, 390, 392, 439, 363, 402, 403, 450, 388, 416, 407, 449, 388, 404, 404, 451, 405, 433, 423, 473, 408, 436, 434, 488, 409, 455, 463, 525, 423, 466, 461, 534, 466, 493, 497, 554, 476, 500, 495, 579, 499, 528, 535, 605, 433, 542, 538, 723
