out.270.19
out.270.20
out.270.21
out.270.22
out.270.23
out.271.00
out.271.01
out.271.02
out.271.03
out.271.04
out.271.05
out.271.06
out.271.07
out.271.08
out.271.09
out.271.10
out.271.11
out.271.12
out.271.13
out.271.14
out.271.15
out.271.16
out.271.17
out.271.18
out.271.19
out.271.20
out.271.21
out.271.22
out.271.23
out.272.00
out.272.01
out.272.02
out.272.03
out.272.04
out.272.05
out.272.06
out.272.07
out.272.08
out.272.09
out.272.10
out.272.11
out.272.12
out.272.13
out.272.14
out.272.15
out.272.16
out.272.17
out.272.18
out.272.19
out.272.20
out.272.21
out.272.22
out.272.23
out.273.00
out.273.01
out.273.02
out.273.03
out.273.04
out.273.05
out.273.06
out.273.07
out.273.08
out.273.09
out.273.10
out.273.11
out.273.12
out.273.13
out.273.14
out.273.15
out.273.16
out.273.17
out.273.18
out.273.19
out.273.20
out.273.21
out.273.22
out.273.23
out.274.00
out.274.01
out.274.02
out.274.03
out.274.04
out.274.05
out.274.06
out.274.07
out.274.08
out.274.09
out.274.10
out.274.11
out.274.12
out.274.13
out.274.14
out.274.15
out.274.16
out.274.17
out.274.18
out.274.19
out.274.20
out.274.21
out.274.22
out.274.23
out.275.00
out.275.01
out.275.02
out.275.03
out.275.04
out.275.05
out.275.06
out.275.07
out.275.08
out.275.09
out.275.10
out.275.11
out.275.12
out.275.13
out.275.14
out.275.15
out.275.16
out.275.17
out.275.18
out.275.19
out.275.20
out.275.21
out.275.22
out.275.23
out.276.00
out.276.01
