<?xml version="1.0" encoding="UTF-8"?>
<svg width="32px" height="32px" viewBox="0 0 32 32" version="1.1" xmlns="http://www.w3.org/2000/svg" xmlns:xlink="http://www.w3.org/1999/xlink">
    <!-- Generator: Sketch 48.1 (47250) - http://www.bohemiancoding.com/sketch -->
    <title>FBDir</title>
    <desc>Created with Sketch.</desc>
    <defs></defs>
    <g id="Artboard" stroke="none" stroke-width="1" fill="none" fill-rule="evenodd" transform="translate(-320.000000, -65.000000)">
        <g id="fallback-dir-copy" transform="translate(325.000000, 66.000000)" fill-rule="nonzero">
            <path d="M23.3076923,9 C23.6900192,9 24,8.69776875 24,8.325 L24,6.075 C24,5.70223125 23.6900192,5.4 23.3076923,5.4 L22.1538462,5.4 L22.1538462,2.7 C22.1538462,1.2088125 20.9140385,0 19.3846154,0 L2.76923077,0 C1.23980769,0 0,1.2088125 0,2.7 L0,26.1 C0,27.5911875 1.23980769,28.8 2.76923077,28.8 L19.3846154,28.8 C20.9140385,28.8 22.1538462,27.5911875 22.1538462,26.1 L22.1538462,23.4 L23.3076923,23.4 C23.6900192,23.4 24,23.0977688 24,22.725 L24,20.475 C24,20.1022312 23.6900192,19.8 23.3076923,19.8 L22.1538462,19.8 L22.1538462,16.2 L23.3076923,16.2 C23.6900192,16.2 24,15.8977688 24,15.525 L24,13.275 C24,12.9022312 23.6900192,12.6 23.3076923,12.6 L22.1538462,12.6 L22.1538462,9 L23.3076923,9 Z" id="Shape" fill="#000000"></path>
            <g id="Group-2" transform="translate(3.428571, 1.714286)" fill="#FFFFFF">
                <path d="M12.3227454,1.62857143 L13.4332185,1.62857143 C13.635789,1.62857143 13.8,1.79288918 13.8,1.99553571 L13.8,6.6908404 C13.8,6.89348694 13.635789,7.05780469 13.4332185,7.05780469 L8.74096563,7.05780469 C8.5383951,7.05780469 8.37418415,6.89348694 8.37418415,6.6908404 L8.37418415,5.57964509 C8.37418415,5.37009142 8.54928134,5.20307466 8.75851512,5.21310729 L11.0613469,5.46058023 C10.3162021,4.35259183 9.07152659,3.675 7.71038591,3.675 C5.83243815,3.675 4.21707324,4.96558147 3.7853237,6.7672533 C3.74561903,6.93293465 3.5984292,7.05 3.42849112,7.05 L2.2788326,7.05 C2.04938933,7.05 1.87562762,6.84155497 1.91805025,6.61618348 C2.4386861,3.84962772 4.86389947,1.81607143 7.71038591,1.81607143 C9.46112432,1.81607143 11.0869896,2.58466677 12.0492593,3.95291687 L11.9563666,2.01308875 C11.9463434,1.80378122 12.1132696,1.62857143 12.3227454,1.62857143 Z" id="Path"></path>
                <path d="M7.71038591,11.7535714 C9.58833366,11.7535714 11.2036986,10.46299 11.6354481,8.66131813 C11.6751528,8.49563678 11.8223426,8.37857143 11.9922807,8.37857143 L13.1419392,8.37857143 C13.3713825,8.37857143 13.5451442,8.58701645 13.5027216,8.81238795 C12.9820857,11.5789437 10.5568723,13.6125 7.71038591,13.6125 C5.96148298,13.6125 4.33713843,12.8455085 3.3748298,11.4793672 L3.47154016,13.4147153 C3.4820219,13.624303 3.31499613,13.8 3.105217,13.8 L1.99535291,13.8 C1.79278238,13.8 1.62857143,13.6356822 1.62857143,13.4330357 L1.62857143,8.73775446 C1.62857143,8.53510793 1.79278238,8.37079018 1.99535291,8.37079018 L6.68758238,8.37079018 C6.89015291,8.37079018 7.05436386,8.53510793 7.05436386,8.73775446 L7.05436386,9.84897321 C7.05436386,10.0585034 6.8792931,10.2255132 6.67006486,10.2155114 L4.35930879,9.96789885 C5.10445142,11.0759314 6.34919671,11.7535714 7.71038591,11.7535714 Z" id="Path"></path>
            </g>
        </g>
    </g>
</svg>