<?xml version="1.0" encoding="UTF-8"?>
<svg width="32px" height="32px" viewBox="0 0 32 32" version="1.1" xmlns="http://www.w3.org/2000/svg" xmlns:xlink="http://www.w3.org/1999/xlink">
    <!-- Generator: Sketch 48.1 (47250) - http://www.bohemiancoding.com/sketch -->
    <title>reachable-IPv4</title>
    <desc>Created with Sketch.</desc>
    <defs></defs>
    <g id="Artboard" stroke="none" stroke-width="1" fill="none" fill-rule="evenodd" transform="translate(-80.000000, -128.000000)">
        <g id="reacheable-IPv4" transform="translate(86.000000, 130.000000)" fill="#000000">
            <path d="M3.64235294,18.9952941 L5.17411765,24.5623529 L6.92,18.9952941 L9.65411765,18.9952941 L6.44235294,28.2352941 L3.80705882,28.2352941 L0.743529412,18.9952941 L3.64235294,18.9952941 Z M18.0047059,15.2894118 L18.0047059,23.1458824 L19.1576471,23.1458824 L19.1576471,25.3858824 L18.0047059,25.3858824 L18.0047059,28.2352941 L15.3694118,28.2352941 L15.3694118,25.3858824 L10.4282353,25.3858824 L10.4282353,23.0964706 L15.6494118,15.2894118 L18.0047059,15.2894118 Z M15.3694118,23.1458824 L15.3694118,19.3576471 L12.8329412,23.1458824 L15.3694118,23.1458824 Z" id="v4"></path>
            <g id="exchange-alt-copy-2" transform="translate(1.176471, 0.000000)" fill-rule="nonzero">
                <path d="M3.55271368e-15,3.62391924 L3.55271368e-15,3.10632709 C3.55271368e-15,2.67753435 0.370346967,2.32993887 0.827205882,2.32993887 L13.2352941,2.32993887 L13.2352941,0.777162432 C13.2352941,0.0859504705 14.1279527,-0.25938054 14.647438,0.228158913 L17.4047909,2.81611964 C17.7278148,3.11933159 17.7278148,3.61091473 17.4047909,3.91409433 L14.647438,6.50205507 C14.1299173,6.9876859 13.2352941,6.64717496 13.2352941,5.9530839 L13.2352941,4.40030746 L0.827205882,4.40030746 C0.370346967,4.40030746 3.55271368e-15,4.05271198 3.55271368e-15,3.62391924 Z M16.8198529,8.54104463 L4.41176471,8.54104463 L4.41176471,6.98826819 C4.41176471,6.29877075 3.52038143,5.95049594 2.99962086,6.43926467 L0.242267923,9.0272254 C-0.0807559743,9.33043735 -0.0807559743,9.82202049 0.242267923,10.1252001 L2.99962086,12.7131608 C3.51758961,13.1992769 4.41176471,12.8576661 4.41176471,12.1641897 L4.41176471,10.6114132 L16.8198529,10.6114132 C17.2767119,10.6114132 17.6470588,10.2638177 17.6470588,9.83502499 L17.6470588,9.31743285 C17.6470588,8.8886401 17.2767119,8.54104463 16.8198529,8.54104463 Z" id="Shape"></path>
            </g>
        </g>
    </g>
</svg>