<?xml version="1.0" encoding="UTF-8"?>
<svg width="32px" height="32px" viewBox="0 0 32 32" version="1.1" xmlns="http://www.w3.org/2000/svg" xmlns:xlink="http://www.w3.org/1999/xlink">
    <!-- Generator: Sketch 48.1 (47250) - http://www.bohemiancoding.com/sketch -->
    <title>fingerprint</title>
    <desc>Created with Sketch.</desc>
    <defs></defs>
    <g id="Artboard" stroke="none" stroke-width="1" fill="none" fill-rule="evenodd" transform="translate(-384.000000, -192.000000)">
        <path d="M396.427961,219.636778 C394.987181,218.195997 394.320384,217.335615 393.371701,215.622316 C392.317744,213.743522 391.764737,211.453055 391.764737,208.990003 C391.764737,204.393529 395.68995,200.655004 400.504737,200.655004 C405.319523,200.655004 409.244738,204.393531 409.244738,208.990003 C409.244738,209.548074 408.80281,209.990003 408.244738,209.990003 C407.686666,209.990003 407.244738,209.548074 407.244738,208.990003 C407.244738,205.500943 404.224282,202.655003 400.504738,202.655003 C396.785194,202.655003 393.764738,205.500944 393.764738,208.990003 C393.764738,211.111461 394.235764,213.063392 395.128188,214.643431 C395.977552,216.16963 396.521314,216.860612 397.86599,218.222816 C398.242655,218.619309 398.242655,219.2357 397.852908,219.644986 C397.645579,219.833469 397.391746,219.935001 397.129739,219.935001 C396.858438,219.935001 396.598372,219.826641 396.427961,219.636778 Z M403.094464,215.78194 C400.790783,214.220384 399.414737,211.682905 399.414737,208.990003 C399.414737,208.431932 399.856667,207.990003 400.414737,207.990003 C400.972808,207.990003 401.414737,208.431932 401.414737,208.990003 C401.414737,211.025713 402.456739,212.941272 404.214755,214.122891 C405.233593,214.811682 406.428576,215.145 407.884735,215.145 C408.280758,215.145 408.869696,215.091832 409.399215,214.999179 C409.943567,214.898375 410.461998,215.26251 410.560557,215.814478 C410.661361,216.35883 410.297226,216.877261 409.747109,216.97547 C409.054255,217.10918 408.385769,217.160001 407.884735,217.160001 C406.048138,217.160001 404.424544,216.69444 403.094464,215.78194 Z M404.608061,220.210944 C402.188785,219.541458 400.589503,218.637662 398.918595,216.997408 C396.770412,214.864569 395.589737,212.025327 395.589737,208.99 C395.589737,206.417885 397.775646,204.329999 400.459737,204.329999 C403.143829,204.329999 405.329737,206.417884 405.329737,208.99 C405.329737,210.454286 406.610555,211.65 408.199737,211.65 C409.788919,211.65 411.069737,210.454287 411.069737,208.99 C411.069737,203.477419 406.310848,198.995 400.444737,198.995 C396.275019,198.995 392.466279,201.314982 390.754987,204.898455 C390.187118,206.077877 389.894736,207.465762 389.894736,208.990001 C389.894736,210.711065 390.144771,212.346424 390.883073,214.315256 C391.083722,214.836946 390.820462,215.419879 390.304482,215.598336 C389.788447,215.796812 389.203759,215.526471 389.020581,215.017583 C388.274808,213.023783 387.909737,211.044115 387.909737,208.989998 C387.909737,207.157399 388.261167,205.485206 388.954066,204.022421 C390.992222,199.74689 395.507306,196.979999 400.444737,196.979999 C407.405856,196.979999 413.069737,202.354761 413.069737,208.974999 C413.069737,211.547115 410.88383,213.635 408.199737,213.635 C405.515644,213.635 403.329737,211.547115 403.329737,208.974999 C403.329737,207.510713 402.048919,206.314999 400.459737,206.314999 C398.870555,206.314999 397.589737,207.510712 397.589737,208.974999 C397.589737,211.478098 398.55646,213.812752 400.320576,215.56229 C401.721778,216.948744 403.052294,217.703127 405.112476,218.273001 C405.64728,218.411653 405.95861,218.96582 405.819031,219.483109 C405.721364,219.932374 405.313842,220.25 404.869736,220.25 C404.792291,220.25 404.7073,220.235834 404.608061,220.210944 Z" id="Fill-2" fill="#000000" fill-rule="nonzero"></path>
    </g>
</svg>