<?xml version="1.0" encoding="UTF-8" standalone="no"?>
<!-- Created with Inkscape (http://www.inkscape.org/) -->

<svg
   xmlns:dc="http://purl.org/dc/elements/1.1/"
   xmlns:cc="http://creativecommons.org/ns#"
   xmlns:rdf="http://www.w3.org/1999/02/22-rdf-syntax-ns#"
   xmlns:svg="http://www.w3.org/2000/svg"
   xmlns="http://www.w3.org/2000/svg"
   xmlns:sodipodi="http://sodipodi.sourceforge.net/DTD/sodipodi-0.dtd"
   xmlns:inkscape="http://www.inkscape.org/namespaces/inkscape"
   width="770.74414"
   height="218.13622"
   id="svg2"
   version="1.1"
   inkscape:version="0.48.0 r9654"
   sodipodi:docname="tor-data.svg.2011_05_06_11_21_03.0.svg">
  <defs
     id="defs4" />
  <sodipodi:namedview
     id="base"
     pagecolor="#ffffff"
     bordercolor="#666666"
     borderopacity="1.0"
     inkscape:pageopacity="0.0"
     inkscape:pageshadow="2"
     inkscape:zoom="1.979899"
     inkscape:cx="402.88635"
     inkscape:cy="53.477974"
     inkscape:document-units="px"
     inkscape:current-layer="layer1"
     showgrid="true"
     inkscape:window-width="1920"
     inkscape:window-height="1126"
     inkscape:window-x="0"
     inkscape:window-y="26"
     inkscape:window-maximized="1"
     showguides="true"
     inkscape:guide-bbox="true"
     fit-margin-top="5"
     fit-margin-left="5"
     fit-margin-right="5"
     fit-margin-bottom="5">
    <inkscape:grid
       type="xygrid"
       id="grid4099"
       empspacing="5"
       visible="true"
       enabled="true"
       snapvisiblegridlinesonly="true"
       dotted="false"
       spacingx="5px"
       spacingy="5px" />
  </sodipodi:namedview>
  <metadata
     id="metadata7">
    <rdf:RDF>
      <cc:Work
         rdf:about="">
        <dc:format>image/svg+xml</dc:format>
        <dc:type
           rdf:resource="http://purl.org/dc/dcmitype/StillImage" />
        <dc:title></dc:title>
      </cc:Work>
    </rdf:RDF>
  </metadata>
  <g
     inkscape:label="Layer 1"
     inkscape:groupmode="layer"
     id="layer1"
     transform="translate(-59.970703,-434.42775)">
    <rect
       ry="5"
       rx="5"
       y="497.56396"
       x="549.9707"
       height="20"
       width="100"
       id="rect3069"
       style="fill:#91cf60;fill-opacity:1;fill-rule:evenodd;stroke:none" />
    <rect
       style="fill:#91cf60;fill-opacity:1;fill-rule:evenodd;stroke:none"
       id="rect3063"
       width="100"
       height="20"
       x="250"
       y="497.56396"
       rx="5"
       ry="5" />
    <text
       sodipodi:linespacing="125%"
       id="text3167"
       y="452.76575"
       x="69.249092"
       style="font-size:18px;font-style:normal;font-variant:normal;font-weight:normal;font-stretch:normal;line-height:125%;letter-spacing:0px;word-spacing:0px;fill:#000000;fill-opacity:1;stroke:none;font-family:FreeSans;-inkscape-font-specification:FreeSans"
       xml:space="preserve"><tspan
         y="452.76575"
         x="69.249092"
         id="tspan3169"
         sodipodi:role="line">Application</tspan></text>
    <rect
       ry="5"
       rx="5"
       y="627.56396"
       x="64.970703"
       height="20"
       width="100"
       id="rect3131"
       style="fill:#d73027;fill-opacity:1;fill-rule:evenodd;stroke:none" />
    <text
       sodipodi:linespacing="125%"
       id="text3133"
       y="642.10071"
       x="108.71826"
       style="font-size:12px;font-style:normal;font-variant:normal;font-weight:normal;font-stretch:normal;text-align:start;line-height:125%;letter-spacing:0px;word-spacing:0px;writing-mode:lr-tb;text-anchor:start;fill:#000000;fill-opacity:1;stroke:none;font-family:DejaVu Sans;-inkscape-font-specification:DejaVu Sans"
       xml:space="preserve"><tspan
         style="font-size:12px;font-style:normal;font-variant:normal;font-weight:normal;font-stretch:normal;text-align:start;line-height:125%;writing-mode:lr-tb;text-anchor:start;font-family:DejaVu Sans;-inkscape-font-specification:DejaVu Sans"
         y="642.10071"
         x="108.71826"
         id="tspan3135"
         sodipodi:role="line">IP</tspan></text>
    <rect
       style="fill:#fc8d59;fill-opacity:1;fill-rule:evenodd;stroke:none"
       id="rect3137"
       width="100"
       height="20"
       x="64.970703"
       y="602.56396"
       rx="5"
       ry="5" />
    <text
       xml:space="preserve"
       style="font-size:12px;font-style:normal;font-variant:normal;font-weight:normal;font-stretch:normal;text-align:start;line-height:125%;letter-spacing:0px;word-spacing:0px;writing-mode:lr-tb;text-anchor:start;fill:#000000;fill-opacity:1;stroke:none;font-family:DejaVu Sans;-inkscape-font-specification:DejaVu Sans"
       x="103.15454"
       y="617.09436"
       id="text3139"
       sodipodi:linespacing="125%"><tspan
         sodipodi:role="line"
         id="tspan3141"
         x="103.15454"
         y="617.09436"
         style="font-size:12px;font-style:normal;font-variant:normal;font-weight:normal;font-stretch:normal;text-align:start;line-height:125%;writing-mode:lr-tb;text-anchor:start;font-family:DejaVu Sans;-inkscape-font-specification:DejaVu Sans">TCP</tspan></text>
    <rect
       ry="5"
       rx="5"
       y="522.56396"
       x="250"
       height="20"
       width="100"
       id="rect3155"
       style="fill:#d9ef8b;fill-opacity:1;fill-rule:evenodd;stroke:none" />
    <text
       sodipodi:linespacing="125%"
       id="text3157"
       y="537.0376"
       x="270.72778"
       style="font-size:12px;font-style:normal;font-variant:normal;font-weight:normal;font-stretch:normal;text-align:start;line-height:125%;letter-spacing:0px;word-spacing:0px;writing-mode:lr-tb;text-anchor:start;fill:#000000;fill-opacity:1;stroke:none;font-family:DejaVu Sans;-inkscape-font-specification:DejaVu Sans"
       xml:space="preserve"><tspan
         style="font-size:12px;font-style:normal;font-variant:normal;font-weight:normal;font-stretch:normal;text-align:start;line-height:125%;writing-mode:lr-tb;text-anchor:start;font-family:DejaVu Sans;-inkscape-font-specification:DejaVu Sans"
         y="537.0376"
         x="270.72778"
         id="tspan3159"
         sodipodi:role="line">Cell Auth</tspan></text>
    <rect
       style="fill:#1a9850;fill-opacity:1;fill-rule:evenodd;stroke:none"
       id="rect3161"
       width="125"
       height="20"
       x="225"
       y="472.56396"
       rx="5"
       ry="5" />
    <text
       xml:space="preserve"
       style="font-size:12px;font-style:normal;font-variant:normal;font-weight:normal;font-stretch:normal;text-align:start;line-height:125%;letter-spacing:0px;word-spacing:0px;writing-mode:lr-tb;text-anchor:start;fill:#000000;fill-opacity:1;stroke:none;font-family:DejaVu Sans;-inkscape-font-specification:DejaVu Sans"
       x="260.82227"
       y="485.76904"
       id="text3163"
       sodipodi:linespacing="125%"><tspan
         sodipodi:role="line"
         id="tspan3165"
         x="260.82227"
         y="485.76904"
         style="font-size:12px;font-style:normal;font-variant:normal;font-weight:normal;font-stretch:normal;text-align:start;line-height:125%;writing-mode:lr-tb;text-anchor:start;font-family:DejaVu Sans;-inkscape-font-specification:DejaVu Sans">Gateway</tspan></text>
    <rect
       style="fill:#d73027;fill-opacity:1;fill-rule:evenodd;stroke:none"
       id="rect3173"
       width="125"
       height="20"
       x="225"
       y="627.36218"
       rx="6.25"
       ry="5" />
    <text
       xml:space="preserve"
       style="font-size:13px;font-style:normal;font-variant:normal;font-weight:normal;font-stretch:normal;line-height:125%;letter-spacing:0px;word-spacing:0px;fill:#000000;fill-opacity:1;stroke:none;font-family:DejaVu Sans;-inkscape-font-specification:DejaVu Sans"
       x="281.24756"
       y="642.10071"
       id="text3175"
       sodipodi:linespacing="125%"><tspan
         sodipodi:role="line"
         id="tspan3177"
         x="281.24756"
         y="642.10071"
         style="font-size:13px;font-style:normal;font-variant:normal;font-weight:normal;font-stretch:normal;font-family:DejaVu Sans;-inkscape-font-specification:DejaVu Sans">IP</tspan></text>
    <rect
       ry="5"
       rx="6.25"
       y="602.36218"
       x="225"
       height="20"
       width="125"
       id="rect3179"
       style="fill:#fc8d59;fill-opacity:1;fill-rule:evenodd;stroke:none" />
    <text
       sodipodi:linespacing="125%"
       id="text3181"
       y="617.09436"
       x="275.68384"
       style="font-size:13px;font-style:normal;font-variant:normal;font-weight:normal;font-stretch:normal;line-height:125%;letter-spacing:0px;word-spacing:0px;fill:#000000;fill-opacity:1;stroke:none;font-family:DejaVu Sans;-inkscape-font-specification:DejaVu Sans"
       xml:space="preserve"><tspan
         style="font-size:13px;font-style:normal;font-variant:normal;font-weight:normal;font-stretch:normal;font-family:DejaVu Sans;-inkscape-font-specification:DejaVu Sans"
         y="617.09436"
         x="275.68384"
         id="tspan3183"
         sodipodi:role="line">TCP</tspan></text>
    <rect
       style="fill:#fee08b;fill-opacity:1;fill-rule:evenodd;stroke:none"
       id="rect3185"
       width="100"
       height="20"
       x="250"
       y="572.36218"
       rx="5"
       ry="5" />
    <text
       xml:space="preserve"
       style="font-size:13px;font-style:normal;font-variant:normal;font-weight:normal;font-stretch:normal;line-height:125%;letter-spacing:0px;word-spacing:0px;fill:#000000;fill-opacity:1;stroke:none;font-family:DejaVu Sans;-inkscape-font-specification:DejaVu Sans"
       x="288.66309"
       y="587.09436"
       id="text3187"
       sodipodi:linespacing="125%"><tspan
         sodipodi:role="line"
         id="tspan3189"
         x="288.66309"
         y="587.09436"
         style="font-size:13px;font-style:normal;font-variant:normal;font-weight:normal;font-stretch:normal;font-family:DejaVu Sans;-inkscape-font-specification:DejaVu Sans">TLS</tspan></text>
    <rect
       ry="5"
       rx="5"
       y="547.36218"
       x="250"
       height="20"
       width="100"
       id="rect3191"
       style="fill:#ffffbf;fill-opacity:1;fill-rule:evenodd;stroke:none" />
    <text
       xml:space="preserve"
       style="font-size:18px;font-style:normal;font-variant:normal;font-weight:normal;font-stretch:normal;line-height:125%;letter-spacing:0px;word-spacing:0px;fill:#000000;fill-opacity:1;stroke:none;font-family:FreeSans;-inkscape-font-specification:FreeSans"
       x="254.9707"
       y="452.56396"
       id="text3209"
       sodipodi:linespacing="125%"><tspan
         sodipodi:role="line"
         id="tspan3211"
         x="254.9707"
         y="452.56396">Initiator</tspan></text>
    <text
       sodipodi:linespacing="125%"
       id="text3231"
       y="452.56396"
       x="410.06915"
       style="font-size:18px;font-style:normal;font-variant:normal;font-weight:normal;font-stretch:normal;line-height:125%;letter-spacing:0px;word-spacing:0px;fill:#000000;fill-opacity:1;stroke:none;font-family:FreeSans;-inkscape-font-specification:FreeSans"
       xml:space="preserve"><tspan
         y="452.56396"
         x="410.06915"
         id="tspan3233"
         sodipodi:role="line">Intermediate</tspan></text>
    <rect
       style="fill:#d73027;fill-opacity:1;fill-rule:evenodd;stroke:none"
       id="rect3237"
       width="100"
       height="20"
       x="400"
       y="627.56396"
       rx="5"
       ry="5" />
    <text
       xml:space="preserve"
       style="font-size:13px;font-style:normal;font-variant:normal;font-weight:normal;font-stretch:normal;line-height:125%;letter-spacing:0px;word-spacing:0px;fill:#000000;fill-opacity:1;stroke:none;font-family:DejaVu Sans;-inkscape-font-specification:DejaVu Sans"
       x="443.74756"
       y="642.10071"
       id="text3239"
       sodipodi:linespacing="125%"><tspan
         sodipodi:role="line"
         id="tspan3241"
         x="443.74756"
         y="642.10071"
         style="font-size:13px;font-style:normal;font-variant:normal;font-weight:normal;font-stretch:normal;font-family:DejaVu Sans;-inkscape-font-specification:DejaVu Sans">IP</tspan></text>
    <rect
       ry="5"
       rx="5"
       y="602.56396"
       x="400"
       height="20"
       width="100"
       id="rect3243"
       style="fill:#fc8d59;fill-opacity:1;fill-rule:evenodd;stroke:none" />
    <text
       sodipodi:linespacing="125%"
       id="text3245"
       y="617.09436"
       x="438.18384"
       style="font-size:13px;font-style:normal;font-variant:normal;font-weight:normal;font-stretch:normal;line-height:125%;letter-spacing:0px;word-spacing:0px;fill:#000000;fill-opacity:1;stroke:none;font-family:DejaVu Sans;-inkscape-font-specification:DejaVu Sans"
       xml:space="preserve"><tspan
         style="font-size:13px;font-style:normal;font-variant:normal;font-weight:normal;font-stretch:normal;font-family:DejaVu Sans;-inkscape-font-specification:DejaVu Sans"
         y="617.09436"
         x="438.18384"
         id="tspan3247"
         sodipodi:role="line">TCP</tspan></text>
    <rect
       style="fill:#fee08b;fill-opacity:1;fill-rule:evenodd;stroke:none"
       id="rect3249"
       width="100"
       height="20"
       x="400"
       y="572.56396"
       rx="5"
       ry="5" />
    <text
       xml:space="preserve"
       style="font-size:13px;font-style:normal;font-variant:normal;font-weight:normal;font-stretch:normal;line-height:125%;letter-spacing:0px;word-spacing:0px;fill:#000000;fill-opacity:1;stroke:none;font-family:DejaVu Sans;-inkscape-font-specification:DejaVu Sans"
       x="438.66309"
       y="587.09436"
       id="text3251"
       sodipodi:linespacing="125%"><tspan
         sodipodi:role="line"
         id="tspan3253"
         x="438.66309"
         y="587.09436"
         style="font-size:13px;font-style:normal;font-variant:normal;font-weight:normal;font-stretch:normal;font-family:DejaVu Sans;-inkscape-font-specification:DejaVu Sans">TLS</tspan></text>
    <rect
       ry="5"
       rx="5"
       y="547.56396"
       x="400"
       height="20"
       width="100"
       id="rect3255"
       style="fill:#ffffbf;fill-opacity:1;fill-rule:evenodd;stroke:none" />
    <text
       sodipodi:linespacing="125%"
       id="text3257"
       y="562.20862"
       x="428.84644"
       style="font-size:13px;font-style:normal;font-variant:normal;font-weight:normal;font-stretch:normal;line-height:125%;letter-spacing:0px;word-spacing:0px;fill:#000000;fill-opacity:1;stroke:none;font-family:DejaVu Sans;-inkscape-font-specification:DejaVu Sans"
       xml:space="preserve"><tspan
         style="font-size:13px;font-style:normal;font-variant:normal;font-weight:normal;font-stretch:normal;font-family:DejaVu Sans;-inkscape-font-specification:DejaVu Sans"
         y="562.20862"
         x="428.84644"
         id="tspan3259"
         sodipodi:role="line">Circuit</tspan></text>
    <rect
       ry="5"
       rx="6.25"
       y="627.56396"
       x="550"
       height="20"
       width="125"
       id="rect3275"
       style="fill:#d73027;fill-opacity:1;fill-rule:evenodd;stroke:none" />
    <text
       sodipodi:linespacing="125%"
       id="text3277"
       y="642.30249"
       x="606.24756"
       style="font-size:13px;font-style:normal;font-variant:normal;font-weight:normal;font-stretch:normal;line-height:125%;letter-spacing:0px;word-spacing:0px;fill:#000000;fill-opacity:1;stroke:none;font-family:DejaVu Sans;-inkscape-font-specification:DejaVu Sans"
       xml:space="preserve"><tspan
         style="font-size:13px;font-style:normal;font-variant:normal;font-weight:normal;font-stretch:normal;font-family:DejaVu Sans;-inkscape-font-specification:DejaVu Sans"
         y="642.30249"
         x="606.24756"
         id="tspan3279"
         sodipodi:role="line">IP</tspan></text>
    <rect
       style="fill:#fc8d59;fill-opacity:1;fill-rule:evenodd;stroke:none"
       id="rect3281"
       width="125"
       height="20"
       x="549.53125"
       y="603.03125"
       rx="6.25"
       ry="5" />
    <text
       xml:space="preserve"
       style="font-size:13px;font-style:normal;font-variant:normal;font-weight:normal;font-stretch:normal;line-height:125%;letter-spacing:0px;word-spacing:0px;fill:#000000;fill-opacity:1;stroke:none;font-family:DejaVu Sans;-inkscape-font-specification:DejaVu Sans"
       x="600.68384"
       y="617.29614"
       id="text3283"
       sodipodi:linespacing="125%"><tspan
         sodipodi:role="line"
         id="tspan3285"
         x="600.68384"
         y="617.29614"
         style="font-size:13px;font-style:normal;font-variant:normal;font-weight:normal;font-stretch:normal;font-family:DejaVu Sans;-inkscape-font-specification:DejaVu Sans">TCP</tspan></text>
    <rect
       ry="5"
       rx="5"
       y="572.56396"
       x="550"
       height="20"
       width="100"
       id="rect3287"
       style="fill:#fee08b;fill-opacity:1;fill-rule:evenodd;stroke:none" />
    <text
       sodipodi:linespacing="125%"
       id="text3289"
       y="587.29614"
       x="588.66309"
       style="font-size:13px;font-style:normal;font-variant:normal;font-weight:normal;font-stretch:normal;line-height:125%;letter-spacing:0px;word-spacing:0px;fill:#000000;fill-opacity:1;stroke:none;font-family:DejaVu Sans;-inkscape-font-specification:DejaVu Sans"
       xml:space="preserve"><tspan
         style="font-size:13px;font-style:normal;font-variant:normal;font-weight:normal;font-stretch:normal;font-family:DejaVu Sans;-inkscape-font-specification:DejaVu Sans"
         y="587.29614"
         x="588.66309"
         id="tspan3291"
         sodipodi:role="line">TLS</tspan></text>
    <text
       xml:space="preserve"
       style="font-size:18px;font-style:normal;font-variant:normal;font-weight:normal;font-stretch:normal;line-height:125%;letter-spacing:0px;word-spacing:0px;fill:#000000;fill-opacity:1;stroke:none;font-family:FreeSans;-inkscape-font-specification:FreeSans"
       x="593.8512"
       y="454.56067"
       id="text3311"
       sodipodi:linespacing="125%"><tspan
         sodipodi:role="line"
         id="tspan3313"
         x="593.8512"
         y="454.56067">Exit</tspan></text>
    <text
       sodipodi:linespacing="125%"
       id="text3193"
       y="562.20862"
       x="278.84644"
       style="font-size:13px;font-style:normal;font-variant:normal;font-weight:normal;font-stretch:normal;line-height:125%;letter-spacing:0px;word-spacing:0px;fill:#000000;fill-opacity:1;stroke:none;font-family:DejaVu Sans;-inkscape-font-specification:DejaVu Sans"
       xml:space="preserve"><tspan
         style="font-size:13px;font-style:normal;font-variant:normal;font-weight:normal;font-stretch:normal;font-family:DejaVu Sans;-inkscape-font-specification:DejaVu Sans"
         y="562.20862"
         x="278.84644"
         id="tspan3195"
         sodipodi:role="line">Circuit</tspan></text>
    <rect
       ry="5"
       rx="5.9999995"
       y="-245"
       x="472.56396"
       height="20"
       width="119.99999"
       id="rect3144"
       style="fill:#1a9850;fill-opacity:1;fill-rule:evenodd;stroke:none"
       transform="matrix(0,1,-1,0,0,0)" />
    <rect
       ry="5"
       rx="5"
       y="572.56396"
       x="64.970703"
       height="20"
       width="100"
       id="rect3350"
       style="fill:#1a9850;fill-opacity:1;fill-rule:evenodd;stroke:none" />
    <text
       sodipodi:linespacing="125%"
       id="text3352"
       y="586.93213"
       x="94.436523"
       style="font-size:12px;font-style:normal;font-variant:normal;font-weight:normal;font-stretch:normal;text-align:start;line-height:125%;letter-spacing:0px;word-spacing:0px;writing-mode:lr-tb;text-anchor:start;fill:#000000;fill-opacity:1;stroke:none;font-family:DejaVu Sans;-inkscape-font-specification:DejaVu Sans"
       xml:space="preserve"><tspan
         style="font-size:12px;font-style:normal;font-variant:normal;font-weight:normal;font-stretch:normal;text-align:start;line-height:125%;writing-mode:lr-tb;text-anchor:start;font-family:DejaVu Sans;-inkscape-font-specification:DejaVu Sans"
         y="586.93213"
         x="94.436523"
         id="tspan3354"
         sodipodi:role="line">SOCKS</tspan></text>
    <rect
       style="fill:#ffffbf;fill-opacity:1;fill-rule:evenodd;stroke:none"
       id="rect3356"
       width="100"
       height="20"
       x="64.970703"
       y="547.56396"
       rx="5"
       ry="5" />
    <text
       xml:space="preserve"
       style="font-size:12px;font-style:normal;font-variant:normal;font-weight:normal;font-stretch:normal;text-align:start;line-height:125%;letter-spacing:0px;word-spacing:0px;writing-mode:lr-tb;text-anchor:start;fill:#000000;fill-opacity:1;stroke:none;font-family:DejaVu Sans;-inkscape-font-specification:DejaVu Sans"
       x="99.226562"
       y="560.87451"
       id="text3358"
       sodipodi:linespacing="125%"><tspan
         sodipodi:role="line"
         id="tspan3360"
         x="99.226562"
         y="560.87451"
         style="font-size:12px;font-style:normal;font-variant:normal;font-weight:normal;font-stretch:normal;text-align:start;line-height:125%;writing-mode:lr-tb;text-anchor:start;font-family:DejaVu Sans;-inkscape-font-specification:DejaVu Sans">HTTP</tspan></text>
    <path
       sodipodi:nodetypes="cccccccc"
       inkscape:connector-curvature="0"
       id="path3362"
       d="m 190,637.56396 40,0 c 15,0 -0.0293,-155.00001 14.9707,-155.00001 l 15,0 m 55,0 15,0 c 15,0 0.0293,155.20179 15.0293,155.00001 l 15,0"
       style="fill:none;stroke:#980101;stroke-width:1px;stroke-linecap:butt;stroke-linejoin:miter;stroke-opacity:1" />
    <path
       style="fill:none;stroke:#980101;stroke-width:1px;stroke-linecap:butt;stroke-linejoin:miter;stroke-opacity:1"
       d="m 360,637.56396 45,0 c 10,0 -0.0293,-80 9.9707,-80 l 10,0 m 50,0 10,0 c 10,0 0.0293,80 10.0293,80 l 20,0"
       id="path3364"
       inkscape:connector-curvature="0"
       sodipodi:nodetypes="cccccccc" />
    <path
       sodipodi:nodetypes="cccc"
       inkscape:connector-curvature="0"
       id="path3075"
       d="m 194.9707,637.56395 -35,0 c -10,0 -0.0293,-80 -10.0293,-80 l -14.9707,0"
       style="fill:none;stroke:#980101;stroke-width:1px;stroke-linecap:butt;stroke-linejoin:miter;stroke-opacity:1" />
    <rect
       style="fill:#d9ef8b;fill-opacity:1;fill-rule:evenodd;stroke:none"
       id="rect3366"
       width="100"
       height="20"
       x="550"
       y="522.56396"
       rx="5"
       ry="5" />
    <text
       xml:space="preserve"
       style="font-size:12px;font-style:normal;font-variant:normal;font-weight:normal;font-stretch:normal;text-align:start;line-height:125%;letter-spacing:0px;word-spacing:0px;writing-mode:lr-tb;text-anchor:start;fill:#000000;fill-opacity:1;stroke:none;font-family:DejaVu Sans;-inkscape-font-specification:DejaVu Sans"
       x="572.97949"
       y="537.0376"
       id="text3368"
       sodipodi:linespacing="125%"><tspan
         sodipodi:role="line"
         id="tspan3370"
         x="572.97949"
         y="537.0376"
         style="font-size:12px;font-style:normal;font-variant:normal;font-weight:normal;font-stretch:normal;text-align:start;line-height:125%;writing-mode:lr-tb;text-anchor:start;font-family:DejaVu Sans;-inkscape-font-specification:DejaVu Sans">Cell Auth</tspan></text>
    <rect
       style="fill:#ffffbf;fill-opacity:1;fill-rule:evenodd;stroke:none"
       id="rect3372"
       width="100"
       height="20"
       x="550"
       y="547.56396"
       rx="5"
       ry="5" />
    <text
       xml:space="preserve"
       style="font-size:13px;font-style:normal;font-variant:normal;font-weight:normal;font-stretch:normal;line-height:125%;letter-spacing:0px;word-spacing:0px;fill:#000000;fill-opacity:1;stroke:none;font-family:DejaVu Sans;-inkscape-font-specification:DejaVu Sans"
       x="578.84644"
       y="562.4104"
       id="text3374"
       sodipodi:linespacing="125%"><tspan
         sodipodi:role="line"
         id="tspan3376"
         x="578.84644"
         y="562.4104"
         style="font-size:13px;font-style:normal;font-variant:normal;font-weight:normal;font-stretch:normal;font-family:DejaVu Sans;-inkscape-font-specification:DejaVu Sans">Circuit</tspan></text>
    <rect
       ry="5"
       rx="5"
       y="472.56396"
       x="550"
       height="20"
       width="125"
       id="rect3378"
       style="fill:#1a9850;fill-opacity:1;fill-rule:evenodd;stroke:none" />
    <rect
       transform="matrix(0,1,-1,0,0,0)"
       style="fill:#1a9850;fill-opacity:1;fill-rule:evenodd;stroke:none"
       id="rect3380"
       width="119.99999"
       height="20"
       x="472.56396"
       y="-675"
       rx="5.9999995"
       ry="5" />
    <path
       sodipodi:nodetypes="cccc"
       inkscape:connector-curvature="0"
       id="path3080"
       d="m 515,637.56396 40,0 c 15,0 -0.0293,-155.00001 14.9707,-155.00001 l 15,0"
       style="fill:none;stroke:#980101;stroke-width:1px;stroke-linecap:butt;stroke-linejoin:miter;stroke-opacity:1" />
    <text
       sodipodi:linespacing="125%"
       id="text3382"
       y="485.76904"
       x="585.82227"
       style="font-size:12px;font-style:normal;font-variant:normal;font-weight:normal;font-stretch:normal;text-align:start;line-height:125%;letter-spacing:0px;word-spacing:0px;writing-mode:lr-tb;text-anchor:start;fill:#000000;fill-opacity:1;stroke:none;font-family:DejaVu Sans;-inkscape-font-specification:DejaVu Sans"
       xml:space="preserve"><tspan
         style="font-size:12px;font-style:normal;font-variant:normal;font-weight:normal;font-stretch:normal;text-align:start;line-height:125%;writing-mode:lr-tb;text-anchor:start;font-family:DejaVu Sans;-inkscape-font-specification:DejaVu Sans"
         y="485.76904"
         x="585.82227"
         id="tspan3384"
         sodipodi:role="line">Gateway</tspan></text>
    <path
       style="fill:none;stroke:#980101;stroke-width:1px;stroke-linecap:butt;stroke-linejoin:miter;stroke-opacity:1"
       d="m 639.9707,482.56395 15,0 c 15,0 0.0293,155.20179 15.0293,155.00001 l 20,0"
       id="path4156"
       inkscape:connector-curvature="0"
       sodipodi:nodetypes="cscc" />
    <path
       style="fill:none;stroke:#000000;stroke-width:0.89805281;stroke-linecap:butt;stroke-linejoin:miter;stroke-miterlimit:4;stroke-opacity:1;stroke-dasharray:2.69415846, 2.69415846;stroke-dashoffset:0"
       d="m 189.9707,597.56396 500.0293,0"
       id="path3242"
       inkscape:connector-curvature="0" />
    <text
       sodipodi:linespacing="125%"
       id="text4012"
       y="590.56396"
       x="194.9707"
       style="font-size:10px;font-style:normal;font-variant:normal;font-weight:normal;font-stretch:normal;text-align:start;line-height:125%;letter-spacing:0px;word-spacing:0px;writing-mode:lr-tb;text-anchor:start;fill:#000000;fill-opacity:1;stroke:none;font-family:DejaVu Sans;-inkscape-font-specification:DejaVu Sans"
       xml:space="preserve"><tspan
         style="font-size:10px;font-style:normal;font-variant:normal;font-weight:normal;font-stretch:normal;text-align:start;line-height:125%;writing-mode:lr-tb;text-anchor:start;font-family:DejaVu Sans;-inkscape-font-specification:DejaVu Sans"
         y="590.56396"
         x="194.9707"
         id="tspan4014"
         sodipodi:role="line">Tor</tspan></text>
    <text
       xml:space="preserve"
       style="font-size:10px;font-style:normal;font-variant:normal;font-weight:normal;font-stretch:normal;text-align:start;line-height:125%;letter-spacing:0px;word-spacing:0px;writing-mode:lr-tb;text-anchor:start;fill:#000000;fill-opacity:1;stroke:none;font-family:DejaVu Sans;-inkscape-font-specification:DejaVu Sans"
       x="194.9707"
       y="610.56396"
       id="text4016"
       sodipodi:linespacing="125%"><tspan
         sodipodi:role="line"
         id="tspan4018"
         x="194.9707"
         y="610.56396"
         style="font-size:10px;font-style:normal;font-variant:normal;font-weight:normal;font-stretch:normal;text-align:start;line-height:125%;writing-mode:lr-tb;text-anchor:start;font-family:DejaVu Sans;-inkscape-font-specification:DejaVu Sans">Host</tspan></text>
    <text
       xml:space="preserve"
       style="font-size:12px;font-style:normal;font-variant:normal;font-weight:normal;font-stretch:normal;text-align:start;line-height:125%;letter-spacing:0px;word-spacing:0px;writing-mode:lr-tb;text-anchor:start;fill:#000000;fill-opacity:1;stroke:none;font-family:DejaVu Sans;-inkscape-font-specification:DejaVu Sans"
       x="278.39062"
       y="512.0376"
       id="text3065"
       sodipodi:linespacing="125%"><tspan
         sodipodi:role="line"
         id="tspan3067"
         x="278.39062"
         y="512.0376"
         style="font-size:12px;font-style:normal;font-variant:normal;font-weight:normal;font-stretch:normal;text-align:start;line-height:125%;writing-mode:lr-tb;text-anchor:start;font-family:DejaVu Sans;-inkscape-font-specification:DejaVu Sans">Stream</tspan></text>
    <text
       sodipodi:linespacing="125%"
       id="text3071"
       y="512.0376"
       x="578.36133"
       style="font-size:12px;font-style:normal;font-variant:normal;font-weight:normal;font-stretch:normal;text-align:start;line-height:125%;letter-spacing:0px;word-spacing:0px;writing-mode:lr-tb;text-anchor:start;fill:#000000;fill-opacity:1;stroke:none;font-family:DejaVu Sans;-inkscape-font-specification:DejaVu Sans"
       xml:space="preserve"><tspan
         style="font-size:12px;font-style:normal;font-variant:normal;font-weight:normal;font-stretch:normal;text-align:start;line-height:125%;writing-mode:lr-tb;text-anchor:start;font-family:DejaVu Sans;-inkscape-font-specification:DejaVu Sans"
         y="512.0376"
         x="578.36133"
         id="tspan3073"
         sodipodi:role="line">Stream</tspan></text>
    <text
       xml:space="preserve"
       style="font-size:18px;font-style:normal;font-variant:normal;font-weight:normal;font-stretch:normal;line-height:125%;letter-spacing:0px;word-spacing:0px;fill:#000000;fill-opacity:1;stroke:none;font-family:FreeSans;-inkscape-font-specification:FreeSans"
       x="749.20831"
       y="452.76575"
       id="text3069"
       sodipodi:linespacing="125%"><tspan
         sodipodi:role="line"
         id="tspan3071"
         x="749.20831"
         y="452.76575">Server</tspan></text>
    <rect
       style="fill:#d73027;fill-opacity:1;fill-rule:evenodd;stroke:none"
       id="rect3073"
       width="100"
       height="20"
       x="725.71484"
       y="627.56396"
       rx="5"
       ry="5" />
    <text
       xml:space="preserve"
       style="font-size:12px;font-style:normal;font-variant:normal;font-weight:normal;font-stretch:normal;text-align:start;line-height:125%;letter-spacing:0px;word-spacing:0px;writing-mode:lr-tb;text-anchor:start;fill:#000000;fill-opacity:1;stroke:none;font-family:DejaVu Sans;-inkscape-font-specification:DejaVu Sans"
       x="769.4624"
       y="642.10071"
       id="text3075"
       sodipodi:linespacing="125%"><tspan
         sodipodi:role="line"
         id="tspan3077"
         x="769.4624"
         y="642.10071"
         style="font-size:12px;font-style:normal;font-variant:normal;font-weight:normal;font-stretch:normal;text-align:start;line-height:125%;writing-mode:lr-tb;text-anchor:start;font-family:DejaVu Sans;-inkscape-font-specification:DejaVu Sans">IP</tspan></text>
    <rect
       ry="5"
       rx="5"
       y="602.56396"
       x="725.71484"
       height="20"
       width="100"
       id="rect3079"
       style="fill:#fc8d59;fill-opacity:1;fill-rule:evenodd;stroke:none" />
    <text
       sodipodi:linespacing="125%"
       id="text3081"
       y="617.09436"
       x="763.89868"
       style="font-size:12px;font-style:normal;font-variant:normal;font-weight:normal;font-stretch:normal;text-align:start;line-height:125%;letter-spacing:0px;word-spacing:0px;writing-mode:lr-tb;text-anchor:start;fill:#000000;fill-opacity:1;stroke:none;font-family:DejaVu Sans;-inkscape-font-specification:DejaVu Sans"
       xml:space="preserve"><tspan
         style="font-size:12px;font-style:normal;font-variant:normal;font-weight:normal;font-stretch:normal;text-align:start;line-height:125%;writing-mode:lr-tb;text-anchor:start;font-family:DejaVu Sans;-inkscape-font-specification:DejaVu Sans"
         y="617.09436"
         x="763.89868"
         id="tspan3083"
         sodipodi:role="line">TCP</tspan></text>
    <rect
       ry="5"
       rx="5"
       y="572.56396"
       x="725.71484"
       height="20"
       width="100"
       id="rect3091"
       style="fill:#ffffbf;fill-opacity:1;fill-rule:evenodd;stroke:none" />
    <text
       sodipodi:linespacing="125%"
       id="text3093"
       y="585.87451"
       x="759.9707"
       style="font-size:12px;font-style:normal;font-variant:normal;font-weight:normal;font-stretch:normal;text-align:start;line-height:125%;letter-spacing:0px;word-spacing:0px;writing-mode:lr-tb;text-anchor:start;fill:#000000;fill-opacity:1;stroke:none;font-family:DejaVu Sans;-inkscape-font-specification:DejaVu Sans"
       xml:space="preserve"><tspan
         style="font-size:12px;font-style:normal;font-variant:normal;font-weight:normal;font-stretch:normal;text-align:start;line-height:125%;writing-mode:lr-tb;text-anchor:start;font-family:DejaVu Sans;-inkscape-font-specification:DejaVu Sans"
         y="585.87451"
         x="759.9707"
         id="tspan3095"
         sodipodi:role="line">HTTP</tspan></text>
    <path
       sodipodi:nodetypes="cccc"
       inkscape:connector-curvature="0"
       id="path3097"
       d="m 690,637.56396 45,0 c 10,0 -0.0293,-55.00001 9.9707,-55.00001 l 10,0"
       style="fill:none;stroke:#980101;stroke-width:1px;stroke-linecap:butt;stroke-linejoin:miter;stroke-opacity:1" />
  </g>
</svg>
