<?xml version="1.0" encoding="UTF-8" standalone="no"?>
<!-- Created with Inkscape (http://www.inkscape.org/) -->

<svg
   xmlns:dc="http://purl.org/dc/elements/1.1/"
   xmlns:cc="http://creativecommons.org/ns#"
   xmlns:rdf="http://www.w3.org/1999/02/22-rdf-syntax-ns#"
   xmlns:svg="http://www.w3.org/2000/svg"
   xmlns="http://www.w3.org/2000/svg"
   xmlns:sodipodi="http://sodipodi.sourceforge.net/DTD/sodipodi-0.dtd"
   xmlns:inkscape="http://www.inkscape.org/namespaces/inkscape"
   width="770.74414"
   height="243.13622"
   id="svg2"
   version="1.1"
   inkscape:version="0.48.2 r9819"
   sodipodi:docname="viecco-data.svg">
  <defs
     id="defs4" />
  <sodipodi:namedview
     id="base"
     pagecolor="#ffffff"
     bordercolor="#666666"
     borderopacity="1.0"
     inkscape:pageopacity="0.0"
     inkscape:pageshadow="2"
     inkscape:zoom="1.979899"
     inkscape:cx="383.10285"
     inkscape:cy="66.008237"
     inkscape:document-units="px"
     inkscape:current-layer="layer1"
     showgrid="true"
     inkscape:window-width="1676"
     inkscape:window-height="1030"
     inkscape:window-x="0"
     inkscape:window-y="18"
     inkscape:window-maximized="0"
     showguides="true"
     inkscape:guide-bbox="true"
     fit-margin-top="5"
     fit-margin-left="5"
     fit-margin-right="5"
     fit-margin-bottom="5">
    <inkscape:grid
       type="xygrid"
       id="grid4099"
       empspacing="5"
       visible="true"
       enabled="true"
       snapvisiblegridlinesonly="true"
       dotted="false"
       spacingx="5px"
       spacingy="5px" />
  </sodipodi:namedview>
  <metadata
     id="metadata7">
    <rdf:RDF>
      <cc:Work
         rdf:about="">
        <dc:format>image/svg+xml</dc:format>
        <dc:type
           rdf:resource="http://purl.org/dc/dcmitype/StillImage" />
        <dc:title />
      </cc:Work>
    </rdf:RDF>
  </metadata>
  <g
     inkscape:label="Layer 1"
     inkscape:groupmode="layer"
     id="layer1"
     transform="translate(-59.970703,-409.42775)">
    <rect
       style="fill:#fc8d59;fill-opacity:1;fill-rule:evenodd;stroke:none"
       id="rect3081-7"
       width="60"
       height="20"
       x="533.96655"
       y="572.36218"
       rx="3"
       ry="5" />
    <rect
       ry="5"
       rx="2.7012572"
       y="602.83179"
       x="654.9707"
       height="20"
       width="54.025146"
       id="rect3147"
       style="fill:#fc8d59;fill-opacity:1;fill-rule:evenodd;stroke:none" />
    <rect
       ry="5"
       rx="4.5001464"
       y="467.56396"
       x="534.94141"
       height="20"
       width="90.00293"
       id="rect3069"
       style="fill:#91cf60;fill-opacity:1;fill-rule:evenodd;stroke:none" />
    <rect
       style="fill:#91cf60;fill-opacity:1;fill-rule:evenodd;stroke:none"
       id="rect3063"
       width="100"
       height="20"
       x="250"
       y="467.76575"
       rx="5"
       ry="5" />
    <text
       sodipodi:linespacing="125%"
       id="text3167"
       y="427.76575"
       x="69.150642"
       style="font-size:18px;font-style:normal;font-variant:normal;font-weight:normal;font-stretch:normal;line-height:125%;letter-spacing:0px;word-spacing:0px;fill:#000000;fill-opacity:1;stroke:none;font-family:FreeSans;-inkscape-font-specification:FreeSans"
       xml:space="preserve"><tspan
         y="427.76575"
         x="69.150642"
         id="tspan3169"
         sodipodi:role="line">Application</tspan></text>
    <rect
       ry="5"
       rx="5"
       y="627.56396"
       x="64.970703"
       height="20"
       width="100"
       id="rect3131"
       style="fill:#d73027;fill-opacity:1;fill-rule:evenodd;stroke:none" />
    <text
       sodipodi:linespacing="125%"
       id="text3133"
       y="642.10071"
       x="108.71826"
       style="font-size:12px;font-style:normal;font-variant:normal;font-weight:normal;font-stretch:normal;text-align:start;line-height:125%;letter-spacing:0px;word-spacing:0px;writing-mode:lr-tb;text-anchor:start;fill:#000000;fill-opacity:1;stroke:none;font-family:DejaVu Sans;-inkscape-font-specification:DejaVu Sans"
       xml:space="preserve"><tspan
         style="font-size:12px;font-style:normal;font-variant:normal;font-weight:normal;font-stretch:normal;text-align:start;line-height:125%;writing-mode:lr-tb;text-anchor:start;font-family:DejaVu Sans;-inkscape-font-specification:DejaVu Sans"
         y="642.10071"
         x="108.71826"
         id="tspan3135"
         sodipodi:role="line">IP</tspan></text>
    <rect
       style="fill:#fc8d59;fill-opacity:1;fill-rule:evenodd;stroke:none"
       id="rect3137"
       width="100"
       height="20"
       x="64.970703"
       y="602.56396"
       rx="5"
       ry="5" />
    <text
       xml:space="preserve"
       style="font-size:12px;font-style:normal;font-variant:normal;font-weight:normal;font-stretch:normal;text-align:start;line-height:125%;letter-spacing:0px;word-spacing:0px;writing-mode:lr-tb;text-anchor:start;fill:#000000;fill-opacity:1;stroke:none;font-family:DejaVu Sans;-inkscape-font-specification:DejaVu Sans"
       x="103.15454"
       y="616.73035"
       id="text3139"
       sodipodi:linespacing="125%"><tspan
         sodipodi:role="line"
         id="tspan3141"
         x="103.15454"
         y="616.73035"
         style="font-size:12px;font-style:normal;font-variant:normal;font-weight:normal;font-stretch:normal;text-align:start;line-height:125%;writing-mode:lr-tb;text-anchor:start;font-family:DejaVu Sans;-inkscape-font-specification:DejaVu Sans">TCP</tspan></text>
    <rect
       ry="5"
       rx="5"
       y="492.76575"
       x="250"
       height="20"
       width="100"
       id="rect3155"
       style="fill:#d9ef8b;fill-opacity:1;fill-rule:evenodd;stroke:none" />
    <text
       sodipodi:linespacing="125%"
       id="text3157"
       y="507.23938"
       x="270.72778"
       style="font-size:12px;font-style:normal;font-variant:normal;font-weight:normal;font-stretch:normal;text-align:start;line-height:125%;letter-spacing:0px;word-spacing:0px;writing-mode:lr-tb;text-anchor:start;fill:#000000;fill-opacity:1;stroke:none;font-family:DejaVu Sans;-inkscape-font-specification:DejaVu Sans"
       xml:space="preserve"><tspan
         style="font-size:12px;font-style:normal;font-variant:normal;font-weight:normal;font-stretch:normal;text-align:start;line-height:125%;writing-mode:lr-tb;text-anchor:start;font-family:DejaVu Sans;-inkscape-font-specification:DejaVu Sans"
         y="507.23938"
         x="270.72778"
         id="tspan3159"
         sodipodi:role="line">Cell Auth</tspan></text>
    <rect
       style="fill:#1a9850;fill-opacity:1;fill-rule:evenodd;stroke:none"
       id="rect3161"
       width="125"
       height="20"
       x="225"
       y="442.76575"
       rx="5"
       ry="5" />
    <text
       xml:space="preserve"
       style="font-size:12px;font-style:normal;font-variant:normal;font-weight:normal;font-stretch:normal;text-align:start;line-height:125%;letter-spacing:0px;word-spacing:0px;writing-mode:lr-tb;text-anchor:start;fill:#000000;fill-opacity:1;stroke:none;font-family:DejaVu Sans;-inkscape-font-specification:DejaVu Sans"
       x="260.82227"
       y="455.97083"
       id="text3163"
       sodipodi:linespacing="125%"><tspan
         sodipodi:role="line"
         id="tspan3165"
         x="260.82227"
         y="455.97083"
         style="font-size:12px;font-style:normal;font-variant:normal;font-weight:normal;font-stretch:normal;text-align:start;line-height:125%;writing-mode:lr-tb;text-anchor:start;font-family:DejaVu Sans;-inkscape-font-specification:DejaVu Sans">Gateway</tspan></text>
    <rect
       style="fill:#d73027;fill-opacity:1;fill-rule:evenodd;stroke:none"
       id="rect3173"
       width="125"
       height="20"
       x="225"
       y="627.36218"
       rx="6.25"
       ry="5" />
    <text
       xml:space="preserve"
       style="font-size:13px;font-style:normal;font-variant:normal;font-weight:normal;font-stretch:normal;line-height:125%;letter-spacing:0px;word-spacing:0px;fill:#000000;fill-opacity:1;stroke:none;font-family:DejaVu Sans;-inkscape-font-specification:DejaVu Sans"
       x="281.24756"
       y="642.10071"
       id="text3175"
       sodipodi:linespacing="125%"><tspan
         sodipodi:role="line"
         id="tspan3177"
         x="281.24756"
         y="642.10071"
         style="font-size:13px;font-style:normal;font-variant:normal;font-weight:normal;font-stretch:normal;font-family:DejaVu Sans;-inkscape-font-specification:DejaVu Sans">IP</tspan></text>
    <rect
       style="fill:#fee08b;fill-opacity:1;fill-rule:evenodd;stroke:none"
       id="rect3185"
       width="100"
       height="20"
       x="250"
       y="542.36218"
       rx="5"
       ry="5" />
    <text
       xml:space="preserve"
       style="font-size:13px;font-style:normal;font-variant:normal;font-weight:normal;font-stretch:normal;line-height:125%;letter-spacing:0px;word-spacing:0px;fill:#000000;fill-opacity:1;stroke:none;font-family:DejaVu Sans;-inkscape-font-specification:DejaVu Sans"
       x="259.9707"
       y="557.56396"
       id="text3187"
       sodipodi:linespacing="125%"><tspan
         sodipodi:role="line"
         id="tspan3189"
         x="259.9707"
         y="557.56396"
         style="font-size:13px;font-style:normal;font-variant:normal;font-weight:normal;font-stretch:normal;font-family:DejaVu Sans;-inkscape-font-specification:DejaVu Sans">Link Crypto</tspan></text>
    <rect
       ry="5"
       rx="5"
       y="517.56396"
       x="250"
       height="20"
       width="100"
       id="rect3191"
       style="fill:#fffebf;fill-opacity:1;fill-rule:evenodd;stroke:none" />
    <text
       xml:space="preserve"
       style="font-size:18px;font-style:normal;font-variant:normal;font-weight:normal;font-stretch:normal;line-height:125%;letter-spacing:0px;word-spacing:0px;fill:#000000;fill-opacity:1;stroke:none;font-family:FreeSans;-inkscape-font-specification:FreeSans"
       x="254.87225"
       y="427.56396"
       id="text3209"
       sodipodi:linespacing="125%"><tspan
         sodipodi:role="line"
         id="tspan3211"
         x="254.87225"
         y="427.56396">Initiator</tspan></text>
    <text
       sodipodi:linespacing="125%"
       id="text3231"
       y="427.56396"
       x="409.9707"
       style="font-size:18px;font-style:normal;font-variant:normal;font-weight:normal;font-stretch:normal;line-height:125%;letter-spacing:0px;word-spacing:0px;fill:#000000;fill-opacity:1;stroke:none;font-family:FreeSans;-inkscape-font-specification:FreeSans"
       xml:space="preserve"><tspan
         y="427.56396"
         x="409.9707"
         id="tspan3233"
         sodipodi:role="line">Intermediate</tspan></text>
    <rect
       style="fill:#d73027;fill-opacity:1;fill-rule:evenodd;stroke:none"
       id="rect3237"
       width="100"
       height="20"
       x="400"
       y="627.56396"
       rx="5"
       ry="5" />
    <text
       xml:space="preserve"
       style="font-size:13px;font-style:normal;font-variant:normal;font-weight:normal;font-stretch:normal;line-height:125%;letter-spacing:0px;word-spacing:0px;fill:#000000;fill-opacity:1;stroke:none;font-family:DejaVu Sans;-inkscape-font-specification:DejaVu Sans"
       x="443.74756"
       y="642.10071"
       id="text3239"
       sodipodi:linespacing="125%"><tspan
         sodipodi:role="line"
         id="tspan3241"
         x="443.74756"
         y="642.10071"
         style="font-size:13px;font-style:normal;font-variant:normal;font-weight:normal;font-stretch:normal;font-family:DejaVu Sans;-inkscape-font-specification:DejaVu Sans">IP</tspan></text>
    <rect
       ry="5"
       rx="5"
       y="572.56396"
       x="400"
       height="20"
       width="100"
       id="rect3243"
       style="fill:#fc8d59;fill-opacity:1;fill-rule:evenodd;stroke:none" />
    <text
       sodipodi:linespacing="125%"
       id="text3245"
       y="587.09436"
       x="438.18384"
       style="font-size:13px;font-style:normal;font-variant:normal;font-weight:normal;font-stretch:normal;line-height:125%;letter-spacing:0px;word-spacing:0px;fill:#000000;fill-opacity:1;stroke:none;font-family:DejaVu Sans;-inkscape-font-specification:DejaVu Sans"
       xml:space="preserve"><tspan
         style="font-size:13px;font-style:normal;font-variant:normal;font-weight:normal;font-stretch:normal;font-family:DejaVu Sans;-inkscape-font-specification:DejaVu Sans"
         y="587.09436"
         x="438.18384"
         id="tspan3247"
         sodipodi:role="line">UDP</tspan></text>
    <rect
       style="fill:#fee08b;fill-opacity:1;fill-rule:evenodd;stroke:none"
       id="rect3249"
       width="100"
       height="20"
       x="400"
       y="542.56396"
       rx="5"
       ry="5" />
    <rect
       ry="5"
       rx="5"
       y="517.91931"
       x="401.12427"
       height="20"
       width="100"
       id="rect3255"
       style="fill:#ffffbf;fill-opacity:1;fill-rule:evenodd;stroke:none" />
    <text
       sodipodi:linespacing="125%"
       id="text3257"
       y="532.56396"
       x="429.9707"
       style="font-size:13px;font-style:normal;font-variant:normal;font-weight:normal;font-stretch:normal;line-height:125%;letter-spacing:0px;word-spacing:0px;fill:#000000;fill-opacity:1;stroke:none;font-family:DejaVu Sans;-inkscape-font-specification:DejaVu Sans"
       xml:space="preserve"><tspan
         style="font-size:13px;font-style:normal;font-variant:normal;font-weight:normal;font-stretch:normal;font-family:DejaVu Sans;-inkscape-font-specification:DejaVu Sans"
         y="532.56396"
         x="429.9707"
         id="tspan3259"
         sodipodi:role="line">Circuit</tspan></text>
    <rect
       ry="5"
       rx="8.75"
       y="627.56396"
       x="534.9707"
       height="20"
       width="175"
       id="rect3275"
       style="fill:#d73027;fill-opacity:1;fill-rule:evenodd;stroke:none" />
    <text
       sodipodi:linespacing="125%"
       id="text3277"
       y="642.30249"
       x="591.21826"
       style="font-size:13px;font-style:normal;font-variant:normal;font-weight:normal;font-stretch:normal;line-height:125%;letter-spacing:0px;word-spacing:0px;fill:#000000;fill-opacity:1;stroke:none;font-family:DejaVu Sans;-inkscape-font-specification:DejaVu Sans"
       xml:space="preserve"><tspan
         style="font-size:13px;font-style:normal;font-variant:normal;font-weight:normal;font-stretch:normal;font-family:DejaVu Sans;-inkscape-font-specification:DejaVu Sans"
         y="642.30249"
         x="591.21826"
         id="tspan3279"
         sodipodi:role="line">IP</tspan></text>
    <rect
       ry="5"
       rx="4.5001464"
       y="542.83179"
       x="534.96777"
       height="20"
       width="90.00293"
       id="rect3287"
       style="fill:#fee08b;fill-opacity:1;fill-rule:evenodd;stroke:none" />
    <text
       xml:space="preserve"
       style="font-size:18px;font-style:normal;font-variant:normal;font-weight:normal;font-stretch:normal;line-height:125%;letter-spacing:0px;word-spacing:0px;fill:#000000;fill-opacity:1;stroke:none;font-family:FreeSans;-inkscape-font-specification:FreeSans"
       x="579.94141"
       y="427.56396"
       id="text3311"
       sodipodi:linespacing="125%"><tspan
         sodipodi:role="line"
         id="tspan3313"
         x="579.94141"
         y="427.56396">Exit</tspan></text>
    <text
       sodipodi:linespacing="125%"
       id="text3193"
       y="532.4104"
       x="278.84644"
       style="font-size:13px;font-style:normal;font-variant:normal;font-weight:normal;font-stretch:normal;line-height:125%;letter-spacing:0px;word-spacing:0px;fill:#000000;fill-opacity:1;stroke:none;font-family:DejaVu Sans;-inkscape-font-specification:DejaVu Sans"
       xml:space="preserve"><tspan
         style="font-size:13px;font-style:normal;font-variant:normal;font-weight:normal;font-stretch:normal;font-family:DejaVu Sans;-inkscape-font-specification:DejaVu Sans"
         y="532.4104"
         x="278.84644"
         id="tspan3195"
         sodipodi:role="line">Circuit</tspan></text>
    <rect
       ry="5"
       rx="8.9899101"
       y="-245"
       x="442.76575"
       height="20"
       width="179.7982"
       id="rect3144"
       style="fill:#1a9850;fill-opacity:1;fill-rule:evenodd;stroke:none"
       transform="matrix(0,1,-1,0,0,0)" />
    <rect
       ry="5"
       rx="5"
       y="543.1958"
       x="64.970703"
       height="20"
       width="100"
       id="rect3350"
       style="fill:#1a9850;fill-opacity:1;fill-rule:evenodd;stroke:none" />
    <text
       sodipodi:linespacing="125%"
       id="text3352"
       y="557.56396"
       x="94.436523"
       style="font-size:12px;font-style:normal;font-variant:normal;font-weight:normal;font-stretch:normal;text-align:start;line-height:125%;letter-spacing:0px;word-spacing:0px;writing-mode:lr-tb;text-anchor:start;fill:#000000;fill-opacity:1;stroke:none;font-family:DejaVu Sans;-inkscape-font-specification:DejaVu Sans"
       xml:space="preserve"><tspan
         style="font-size:12px;font-style:normal;font-variant:normal;font-weight:normal;font-stretch:normal;text-align:start;line-height:125%;writing-mode:lr-tb;text-anchor:start;font-family:DejaVu Sans;-inkscape-font-specification:DejaVu Sans"
         y="557.56396"
         x="94.436523"
         id="tspan3354"
         sodipodi:role="line">SOCKS</tspan></text>
    <rect
       style="fill:#ffffbf;fill-opacity:1;fill-rule:evenodd;stroke:none"
       id="rect3356"
       width="100"
       height="20"
       x="64.970703"
       y="518.1958"
       rx="5"
       ry="5" />
    <text
       xml:space="preserve"
       style="font-size:12px;font-style:normal;font-variant:normal;font-weight:normal;font-stretch:normal;text-align:start;line-height:125%;letter-spacing:0px;word-spacing:0px;writing-mode:lr-tb;text-anchor:start;fill:#000000;fill-opacity:1;stroke:none;font-family:DejaVu Sans;-inkscape-font-specification:DejaVu Sans"
       x="99.226562"
       y="531.50635"
       id="text3358"
       sodipodi:linespacing="125%"><tspan
         sodipodi:role="line"
         id="tspan3360"
         x="99.226562"
         y="531.50635"
         style="font-size:12px;font-style:normal;font-variant:normal;font-weight:normal;font-stretch:normal;text-align:start;line-height:125%;writing-mode:lr-tb;text-anchor:start;font-family:DejaVu Sans;-inkscape-font-specification:DejaVu Sans">HTTP</tspan></text>
    <path
       sodipodi:nodetypes="cccc"
       inkscape:connector-curvature="0"
       id="path3075"
       d="m 194.9707,637.56395 -35,0 c -10,0 -0.0293,-109.99998 -10.0293,-109.99998 l -14.9707,0"
       style="fill:none;stroke:#980101;stroke-width:1.17260385px;stroke-linecap:butt;stroke-linejoin:miter;stroke-opacity:1" />
    <rect
       style="fill:#d9ef8b;fill-opacity:1;fill-rule:evenodd;stroke:none"
       id="rect3366"
       width="90.00293"
       height="20"
       x="534.96777"
       y="492.56396"
       rx="4.5001464"
       ry="5" />
    <text
       xml:space="preserve"
       style="font-size:12px;font-style:normal;font-variant:normal;font-weight:normal;font-stretch:normal;text-align:start;line-height:125%;letter-spacing:0px;word-spacing:0px;writing-mode:lr-tb;text-anchor:start;fill:#000000;fill-opacity:1;stroke:none;font-family:DejaVu Sans;-inkscape-font-specification:DejaVu Sans"
       x="557.9502"
       y="507.0376"
       id="text3368"
       sodipodi:linespacing="125%"><tspan
         sodipodi:role="line"
         id="tspan3370"
         x="557.9502"
         y="507.0376"
         style="font-size:12px;font-style:normal;font-variant:normal;font-weight:normal;font-stretch:normal;text-align:start;line-height:125%;writing-mode:lr-tb;text-anchor:start;font-family:DejaVu Sans;-inkscape-font-specification:DejaVu Sans">Cell Auth</tspan></text>
    <rect
       style="fill:#ffffbf;fill-opacity:1;fill-rule:evenodd;stroke:none"
       id="rect3372"
       width="90.00293"
       height="20"
       x="534.96777"
       y="517.56396"
       rx="4.5001464"
       ry="5" />
    <text
       xml:space="preserve"
       style="font-size:13px;font-style:normal;font-variant:normal;font-weight:normal;font-stretch:normal;line-height:125%;letter-spacing:0px;word-spacing:0px;fill:#000000;fill-opacity:1;stroke:none;font-family:DejaVu Sans;-inkscape-font-specification:DejaVu Sans"
       x="563.81714"
       y="532.4104"
       id="text3374"
       sodipodi:linespacing="125%"><tspan
         sodipodi:role="line"
         id="tspan3376"
         x="563.81714"
         y="532.4104"
         style="font-size:13px;font-style:normal;font-variant:normal;font-weight:normal;font-stretch:normal;font-family:DejaVu Sans;-inkscape-font-specification:DejaVu Sans">Circuit</tspan></text>
    <rect
       ry="5"
       rx="4.5999999"
       y="442.56396"
       x="534.9707"
       height="20"
       width="115"
       id="rect3378"
       style="fill:#1a9850;fill-opacity:1;fill-rule:evenodd;stroke:none" />
    <rect
       transform="matrix(0,1,-1,0,0,0)"
       style="fill:#1a9850;fill-opacity:1;fill-rule:evenodd;stroke:none"
       id="rect3380"
       width="179.99997"
       height="20"
       x="442.56396"
       y="-649.9707"
       rx="8.999999"
       ry="5" />
    <text
       sodipodi:linespacing="125%"
       id="text3382"
       y="455.76904"
       x="570.79297"
       style="font-size:12px;font-style:normal;font-variant:normal;font-weight:normal;font-stretch:normal;text-align:start;line-height:125%;letter-spacing:0px;word-spacing:0px;writing-mode:lr-tb;text-anchor:start;fill:#000000;fill-opacity:1;stroke:none;font-family:DejaVu Sans;-inkscape-font-specification:DejaVu Sans"
       xml:space="preserve"><tspan
         style="font-size:12px;font-style:normal;font-variant:normal;font-weight:normal;font-stretch:normal;text-align:start;line-height:125%;writing-mode:lr-tb;text-anchor:start;font-family:DejaVu Sans;-inkscape-font-specification:DejaVu Sans"
         y="455.76904"
         x="570.79297"
         id="tspan3384"
         sodipodi:role="line">Gateway</tspan></text>
    <path
       style="fill:none;stroke:#980101;stroke-width:1.01379383px;stroke-linecap:butt;stroke-linejoin:miter;stroke-opacity:1"
       d="m 624.9414,452.56397 10.0293,0 c 15,0 -5,185.20739 10,185 l 15,0 c 5,0 0,-85 5,-85"
       id="path4156"
       inkscape:connector-curvature="0"
       sodipodi:nodetypes="csccc" />
    <path
       style="fill:none;stroke:#000000;stroke-width:0.89805281;stroke-linecap:butt;stroke-linejoin:miter;stroke-miterlimit:4;stroke-opacity:1;stroke-dasharray:2.69415846, 2.69415846;stroke-dashoffset:0"
       d="m 189.9707,567.56397 500.0293,0"
       id="path3242"
       inkscape:connector-curvature="0" />
    <text
       sodipodi:linespacing="125%"
       id="text4012"
       y="560.56396"
       x="194.9707"
       style="font-size:10px;font-style:normal;font-variant:normal;font-weight:normal;font-stretch:normal;text-align:start;line-height:125%;letter-spacing:0px;word-spacing:0px;writing-mode:lr-tb;text-anchor:start;fill:#000000;fill-opacity:1;stroke:none;font-family:DejaVu Sans;-inkscape-font-specification:DejaVu Sans"
       xml:space="preserve"><tspan
         style="font-size:10px;font-style:normal;font-variant:normal;font-weight:normal;font-stretch:normal;text-align:start;line-height:125%;writing-mode:lr-tb;text-anchor:start;font-family:DejaVu Sans;-inkscape-font-specification:DejaVu Sans"
         y="560.56396"
         x="194.9707"
         id="tspan4014"
         sodipodi:role="line">Tor</tspan></text>
    <text
       xml:space="preserve"
       style="font-size:10px;font-style:normal;font-variant:normal;font-weight:normal;font-stretch:normal;text-align:start;line-height:125%;letter-spacing:0px;word-spacing:0px;writing-mode:lr-tb;text-anchor:start;fill:#000000;fill-opacity:1;stroke:none;font-family:DejaVu Sans;-inkscape-font-specification:DejaVu Sans"
       x="194.9707"
       y="580.56396"
       id="text4016"
       sodipodi:linespacing="125%"><tspan
         sodipodi:role="line"
         id="tspan4018"
         x="194.9707"
         y="580.56396"
         style="font-size:10px;font-style:normal;font-variant:normal;font-weight:normal;font-stretch:normal;text-align:start;line-height:125%;writing-mode:lr-tb;text-anchor:start;font-family:DejaVu Sans;-inkscape-font-specification:DejaVu Sans">Host</tspan></text>
    <text
       xml:space="preserve"
       style="font-size:12px;font-style:normal;font-variant:normal;font-weight:normal;font-stretch:normal;text-align:start;line-height:125%;letter-spacing:0px;word-spacing:0px;writing-mode:lr-tb;text-anchor:start;fill:#000000;fill-opacity:1;stroke:none;font-family:DejaVu Sans;-inkscape-font-specification:DejaVu Sans"
       x="278.39062"
       y="482.23938"
       id="text3065"
       sodipodi:linespacing="125%"><tspan
         sodipodi:role="line"
         id="tspan3067"
         x="278.39062"
         y="482.23938"
         style="font-size:12px;font-style:normal;font-variant:normal;font-weight:normal;font-stretch:normal;text-align:start;line-height:125%;writing-mode:lr-tb;text-anchor:start;font-family:DejaVu Sans;-inkscape-font-specification:DejaVu Sans">Stream</tspan></text>
    <text
       sodipodi:linespacing="125%"
       id="text3071"
       y="482.0376"
       x="563.33203"
       style="font-size:12px;font-style:normal;font-variant:normal;font-weight:normal;font-stretch:normal;text-align:start;line-height:125%;letter-spacing:0px;word-spacing:0px;writing-mode:lr-tb;text-anchor:start;fill:#000000;fill-opacity:1;stroke:none;font-family:DejaVu Sans;-inkscape-font-specification:DejaVu Sans"
       xml:space="preserve"><tspan
         style="font-size:12px;font-style:normal;font-variant:normal;font-weight:normal;font-stretch:normal;text-align:start;line-height:125%;writing-mode:lr-tb;text-anchor:start;font-family:DejaVu Sans;-inkscape-font-specification:DejaVu Sans"
         y="482.0376"
         x="563.33203"
         id="tspan3073"
         sodipodi:role="line">Stream</tspan></text>
    <text
       xml:space="preserve"
       style="font-size:18px;font-style:normal;font-variant:normal;font-weight:normal;font-stretch:normal;line-height:125%;letter-spacing:0px;word-spacing:0px;fill:#000000;fill-opacity:1;stroke:none;font-family:FreeSans;-inkscape-font-specification:FreeSans"
       x="749.10986"
       y="427.76575"
       id="text3069"
       sodipodi:linespacing="125%"><tspan
         sodipodi:role="line"
         id="tspan3071"
         x="749.10986"
         y="427.76575">Server</tspan></text>
    <rect
       style="fill:#d73027;fill-opacity:1;fill-rule:evenodd;stroke:none"
       id="rect3073"
       width="100"
       height="20"
       x="725.71484"
       y="627.56396"
       rx="5"
       ry="5" />
    <text
       xml:space="preserve"
       style="font-size:12px;font-style:normal;font-variant:normal;font-weight:normal;font-stretch:normal;text-align:start;line-height:125%;letter-spacing:0px;word-spacing:0px;writing-mode:lr-tb;text-anchor:start;fill:#000000;fill-opacity:1;stroke:none;font-family:DejaVu Sans;-inkscape-font-specification:DejaVu Sans"
       x="769.4624"
       y="642.10071"
       id="text3075"
       sodipodi:linespacing="125%"><tspan
         sodipodi:role="line"
         id="tspan3077"
         x="769.4624"
         y="642.10071"
         style="font-size:12px;font-style:normal;font-variant:normal;font-weight:normal;font-stretch:normal;text-align:start;line-height:125%;writing-mode:lr-tb;text-anchor:start;font-family:DejaVu Sans;-inkscape-font-specification:DejaVu Sans">IP</tspan></text>
    <rect
       ry="5"
       rx="5"
       y="602.56396"
       x="725.71484"
       height="20"
       width="100"
       id="rect3079"
       style="fill:#fc8d59;fill-opacity:1;fill-rule:evenodd;stroke:none" />
    <text
       sodipodi:linespacing="125%"
       id="text3081"
       y="617.09436"
       x="763.89868"
       style="font-size:12px;font-style:normal;font-variant:normal;font-weight:normal;font-stretch:normal;text-align:start;line-height:125%;letter-spacing:0px;word-spacing:0px;writing-mode:lr-tb;text-anchor:start;fill:#000000;fill-opacity:1;stroke:none;font-family:DejaVu Sans;-inkscape-font-specification:DejaVu Sans"
       xml:space="preserve"><tspan
         style="font-size:12px;font-style:normal;font-variant:normal;font-weight:normal;font-stretch:normal;text-align:start;line-height:125%;writing-mode:lr-tb;text-anchor:start;font-family:DejaVu Sans;-inkscape-font-specification:DejaVu Sans"
         y="617.09436"
         x="763.89868"
         id="tspan3083"
         sodipodi:role="line">TCP</tspan></text>
    <rect
       ry="5"
       rx="5"
       y="572.56396"
       x="725.71484"
       height="20"
       width="100"
       id="rect3091"
       style="fill:#ffffbf;fill-opacity:1;fill-rule:evenodd;stroke:none" />
    <text
       sodipodi:linespacing="125%"
       id="text3093"
       y="585.87451"
       x="759.9707"
       style="font-size:12px;font-style:normal;font-variant:normal;font-weight:normal;font-stretch:normal;text-align:start;line-height:125%;letter-spacing:0px;word-spacing:0px;writing-mode:lr-tb;text-anchor:start;fill:#000000;fill-opacity:1;stroke:none;font-family:DejaVu Sans;-inkscape-font-specification:DejaVu Sans"
       xml:space="preserve"><tspan
         style="font-size:12px;font-style:normal;font-variant:normal;font-weight:normal;font-stretch:normal;text-align:start;line-height:125%;writing-mode:lr-tb;text-anchor:start;font-family:DejaVu Sans;-inkscape-font-specification:DejaVu Sans"
         y="585.87451"
         x="759.9707"
         id="tspan3095"
         sodipodi:role="line">HTTP</tspan></text>
    <path
       sodipodi:nodetypes="ccccc"
       inkscape:connector-curvature="0"
       id="path3097"
       d="m 699.9707,552.56397 c 5,0 0,85 5,85 l 30.0293,-1e-5 c 10,0 -0.0293,-55.00001 9.9707,-55.00001 l 10,0"
       style="fill:none;stroke:#980101;stroke-width:1px;stroke-linecap:butt;stroke-linejoin:miter;stroke-opacity:1" />
    <rect
       style="fill:#fc8d59;fill-opacity:1;fill-rule:evenodd;stroke:none"
       id="rect3081"
       width="60"
       height="20"
       x="289.9707"
       y="572.36218"
       rx="3"
       ry="5" />
    <text
       xml:space="preserve"
       style="font-size:13px;font-style:normal;font-variant:normal;font-weight:normal;font-stretch:normal;line-height:125%;letter-spacing:0px;word-spacing:0px;fill:#000000;fill-opacity:1;stroke:none;font-family:DejaVu Sans;-inkscape-font-specification:DejaVu Sans"
       x="305.94556"
       y="587.09436"
       id="text3083"
       sodipodi:linespacing="125%"><tspan
         sodipodi:role="line"
         id="tspan3085"
         x="305.94556"
         y="587.09436"
         style="font-size:13px;font-style:normal;font-variant:normal;font-weight:normal;font-stretch:normal;font-family:DejaVu Sans;-inkscape-font-specification:DejaVu Sans">UDP</tspan></text>
    <path
       style="fill:none;stroke:#980101;stroke-width:1.02353275px;stroke-linecap:butt;stroke-linejoin:miter;stroke-opacity:1"
       d="m 360,637.56396 45,0 c 10,0 -0.0293,-109.99999 9.9707,-109.99999 l 10,0 m 50,0 10,0 c 10,0 0.0293,109.99999 10.0293,109.99999 l 20,0"
       id="path3364"
       inkscape:connector-curvature="0"
       sodipodi:nodetypes="ccsccscc" />
    <path
       sodipodi:nodetypes="cccc"
       inkscape:connector-curvature="0"
       id="path3080"
       d="m 515,637.56396 24.9707,1e-5 c 15,0 0,-185 15,-185 l 10,0"
       style="fill:none;stroke:#980101;stroke-width:1.01379383px;stroke-linecap:butt;stroke-linejoin:miter;stroke-opacity:1" />
    <path
       sodipodi:nodetypes="cccccccc"
       inkscape:connector-curvature="0"
       id="path3362"
       d="m 190,637.56396 40,0 c 15,0 -0.0293,-184.99999 14.9707,-184.99999 l 15,0 m 55,0 15,0 c 15,0 0.0293,185.20738 15.0293,184.99999 l 15,0"
       style="fill:none;stroke:#980101;stroke-width:1.01379383px;stroke-linecap:butt;stroke-linejoin:miter;stroke-opacity:1" />
    <text
       xml:space="preserve"
       style="font-size:13px;font-style:normal;font-variant:normal;font-weight:normal;font-stretch:normal;line-height:125%;letter-spacing:0px;word-spacing:0px;fill:#000000;fill-opacity:1;stroke:none;font-family:DejaVu Sans;-inkscape-font-specification:DejaVu Sans"
       x="412.9707"
       y="557.56396"
       id="text3187-6"
       sodipodi:linespacing="125%"><tspan
         sodipodi:role="line"
         id="tspan3189-5"
         x="412.9707"
         y="557.56396"
         style="font-size:13px;font-style:normal;font-variant:normal;font-weight:normal;font-stretch:normal;font-family:DejaVu Sans;-inkscape-font-specification:DejaVu Sans">Link Crypto</tspan></text>
    <text
       xml:space="preserve"
       style="font-size:13px;font-style:normal;font-variant:normal;font-weight:normal;font-stretch:normal;line-height:125%;letter-spacing:0px;word-spacing:0px;fill:#000000;fill-opacity:1;stroke:none;font-family:DejaVu Sans;-inkscape-font-specification:DejaVu Sans"
       x="550.94141"
       y="557.56396"
       id="text3187-69"
       sodipodi:linespacing="125%"><tspan
         sodipodi:role="line"
         id="tspan3189-3"
         x="550.94141"
         y="557.56396"
         style="font-size:13px;font-style:normal;font-variant:normal;font-weight:normal;font-stretch:normal;font-family:DejaVu Sans;-inkscape-font-specification:DejaVu Sans">Link Crypto</tspan></text>
    <text
       xml:space="preserve"
       style="font-size:13px;font-style:normal;font-variant:normal;font-weight:normal;font-stretch:normal;line-height:125%;letter-spacing:0px;word-spacing:0px;fill:#000000;fill-opacity:1;stroke:none;font-family:DejaVu Sans;-inkscape-font-specification:DejaVu Sans"
       x="549.94141"
       y="587.09436"
       id="text3083-4"
       sodipodi:linespacing="125%"><tspan
         sodipodi:role="line"
         id="tspan3085-5"
         x="549.94141"
         y="587.09436"
         style="font-size:13px;font-style:normal;font-variant:normal;font-weight:normal;font-stretch:normal;font-family:DejaVu Sans;-inkscape-font-specification:DejaVu Sans">UDP</tspan></text>
    <text
       sodipodi:linespacing="125%"
       id="text3149"
       y="617.56396"
       x="669.9707"
       style="font-size:13px;font-style:normal;font-variant:normal;font-weight:normal;font-stretch:normal;line-height:125%;letter-spacing:0px;word-spacing:0px;fill:#000000;fill-opacity:1;stroke:none;font-family:DejaVu Sans;-inkscape-font-specification:DejaVu Sans"
       xml:space="preserve"><tspan
         style="font-size:13px;font-style:normal;font-variant:normal;font-weight:normal;font-stretch:normal;font-family:DejaVu Sans;-inkscape-font-specification:DejaVu Sans"
         y="617.56396"
         x="669.9707"
         id="tspan3151"
         sodipodi:role="line">TCP</tspan></text>
    <rect
       style="fill:#1a9850;fill-opacity:1;fill-rule:evenodd;stroke:none"
       id="rect3342"
       width="55"
       height="20"
       x="654.9707"
       y="543.1958"
       rx="2.75"
       ry="5" />
    <text
       xml:space="preserve"
       style="font-size:12px;font-style:normal;font-variant:normal;font-weight:normal;font-stretch:normal;text-align:start;line-height:125%;letter-spacing:0px;word-spacing:0px;writing-mode:lr-tb;text-anchor:start;fill:#000000;fill-opacity:1;stroke:none;font-family:DejaVu Sans;-inkscape-font-specification:DejaVu Sans"
       x="663.47577"
       y="557.0589"
       id="text3344"
       sodipodi:linespacing="125%"><tspan
         sodipodi:role="line"
         id="tspan3346"
         x="663.47577"
         y="557.0589"
         style="font-size:12px;font-style:normal;font-variant:normal;font-weight:normal;font-stretch:normal;text-align:start;line-height:125%;writing-mode:lr-tb;text-anchor:start;font-family:DejaVu Sans;-inkscape-font-specification:DejaVu Sans">SOCKS</tspan></text>
  </g>
</svg>
