%!PS-Adobe-3.0 EPSF-3.0
%%Creator: inkscape 0.46
%%Pages: 1
%%Orientation: Portrait
%%BoundingBox: 51 264 536 569
%%HiResBoundingBox: 51.659074 264.7807 535.58458 568.0069
%%EndComments
%%Page: 1 1
0 842 translate
0.8 -0.8 scale
0 0 0 setrgbcolor
[] 0 setdash
1 setlinewidth
0 setlinejoin
0 setlinecap
gsave [1 0 0 1 0 0] concat
gsave [1 0 0 1 -28.262884 -287.64374] concat
gsave
0.87450981 0.87450981 0.87450981 setrgbcolor
newpath
357.01081 641.07475 moveto
357.01081 720.88631 lineto
407.54993 720.88631 lineto
407.54993 640.59395 lineto
398.25171 630.4973 lineto
365.84411 630.4973 lineto
357.01081 641.07475 lineto
closepath
eofill
grestore
0.36862746 0.36862746 0.36862746 setrgbcolor
[] 0 setdash
1 setlinewidth
1 setlinejoin
1 setlinecap
newpath
357.01081 641.07475 moveto
357.01081 720.88631 lineto
407.54993 720.88631 lineto
407.54993 640.59395 lineto
398.25171 630.4973 lineto
365.84411 630.4973 lineto
357.01081 641.07475 lineto
closepath
stroke
gsave [1 0 0 1 0 0] concat
gsave
1 1 1 setrgbcolor
newpath
363.81967 647.51666 moveto
403.2025 647.51666 lineto
403.2025 657.36237 lineto
363.81967 657.36237 lineto
363.81967 647.51666 lineto
closepath
eofill
grestore
1 1 1 setrgbcolor
[] 0 setdash
2.4614267 setlinewidth
0 setlinejoin
0 setlinecap
newpath
363.81967 647.51666 moveto
403.2025 647.51666 lineto
403.2025 657.36237 lineto
363.81967 657.36237 lineto
363.81967 647.51666 lineto
closepath
stroke
grestore
gsave [1 0 0 1 0 0] concat
gsave
<<
/ShadingType 2
/ColorSpace /DeviceRGB
/Coords [27.324621 26.887815 22.311644 26.7868]
/Extend [true true]
/Domain [0 1]
/Function <<
/FunctionType 3
/Functions
[
<<
/FunctionType 2
/Domain [0 1]
/C0 [1 1 1]
/C1 [1 1 1]
/N 1
>>
]
/Domain [0 1]
/Bounds [ ]
/Encode [ 0 1 ]
>>
>>
newpath
376.12683 679.5152 moveto
403.20253 679.5152 lineto
403.20253 689.3609 lineto
376.12683 689.3609 lineto
376.12683 679.5152 lineto
closepath
eoclip
gsave [2.3751799 0 0 1.9527947 324.76378 633.50977] concat
shfill
grestore
grestore
1 1 1 setrgbcolor
[] 0 setdash
2.4614277 setlinewidth
0 setlinejoin
0 setlinecap
newpath
376.12683 679.5152 moveto
403.20253 679.5152 lineto
403.20253 689.3609 lineto
376.12683 689.3609 lineto
376.12683 679.5152 lineto
closepath
stroke
grestore
gsave
0.78431374 0.78431374 0.78431374 setrgbcolor
newpath
374.89609 678.28448 moveto
401.97177 678.28448 lineto
401.97177 688.13019 lineto
374.89609 688.13019 lineto
374.89609 678.28448 lineto
closepath
eofill
grestore
0.67450982 0.67450982 0.67450982 setrgbcolor
[] 0 setdash
2.4614263 setlinewidth
0 setlinejoin
0 setlinecap
newpath
374.89609 678.28448 moveto
401.97177 678.28448 lineto
401.97177 688.13019 lineto
374.89609 688.13019 lineto
374.89609 678.28448 lineto
closepath
stroke
gsave [1 0 0 1 0 0] concat
gsave
1 1 1 setrgbcolor
newpath
363.81967 662.28522 moveto
403.2025 662.28522 lineto
403.2025 672.13092 lineto
363.81967 672.13092 lineto
363.81967 662.28522 lineto
closepath
eofill
grestore
1 1 1 setrgbcolor
[] 0 setdash
2.4614265 setlinewidth
0 setlinejoin
0 setlinecap
newpath
363.81967 662.28522 moveto
403.2025 662.28522 lineto
403.2025 672.13092 lineto
363.81967 672.13092 lineto
363.81967 662.28522 lineto
closepath
stroke
grestore
gsave
0.78431374 0.78431374 0.78431374 setrgbcolor
newpath
362.58896 661.0545 moveto
401.9718 661.0545 lineto
401.9718 670.90021 lineto
362.58896 670.90021 lineto
362.58896 661.0545 lineto
closepath
eofill
grestore
0.67450982 0.67450982 0.67450982 setrgbcolor
[] 0 setdash
2.461427 setlinewidth
0 setlinejoin
0 setlinecap
newpath
362.58896 661.0545 moveto
401.9718 661.0545 lineto
401.9718 670.90021 lineto
362.58896 670.90021 lineto
362.58896 661.0545 lineto
closepath
stroke
gsave
0.78431374 0.78431374 0.78431374 setrgbcolor
newpath
362.58899 646.28595 moveto
401.97183 646.28595 lineto
401.97183 656.13166 lineto
362.58899 656.13166 lineto
362.58899 646.28595 lineto
closepath
eofill
grestore
0.67450982 0.67450982 0.67450982 setrgbcolor
[] 0 setdash
2.4614267 setlinewidth
0 setlinejoin
0 setlinecap
newpath
362.58899 646.28595 moveto
401.97183 646.28595 lineto
401.97183 656.13166 lineto
362.58899 656.13166 lineto
362.58899 646.28595 lineto
closepath
stroke
gsave [2.180292 0 0 2.197975 329.67902 627.54166] concat
gsave [0.779806 0 0 0.773527 -34.68981 5.595099] concat
gsave
0.78431374 0.78431374 0.78431374 setrgbcolor
newpath
68.185294 26.231213 moveto
68.185294 27.430062 67.212315 28.403041 66.013466 28.403041 curveto
64.814617 28.403041 63.841638 27.430062 63.841638 26.231213 curveto
63.841638 25.032364 64.814617 24.059385 66.013466 24.059385 curveto
67.212315 24.059385 68.185294 25.032364 68.185294 26.231213 curveto
closepath
eofill
grestore
0.59215689 0.59215689 0.59215689 setrgbcolor
[] 0 setdash
1.4477295 setlinewidth
0 setlinejoin
0 setlinecap
newpath
68.185294 26.231213 moveto
68.185294 27.430062 67.212315 28.403041 66.013466 28.403041 curveto
64.814617 28.403041 63.841638 27.430062 63.841638 26.231213 curveto
63.841638 25.032364 64.814617 24.059385 66.013466 24.059385 curveto
67.212315 24.059385 68.185294 25.032364 68.185294 26.231213 curveto
closepath
stroke
grestore
gsave [1.008603 0 0 1.000481 -0.07396387 -0.0549963] concat
gsave
1 1 1 setrgbcolor
newpath
16.667518 25.574614 moveto
16.667518 25.853416 16.441243 26.07969 16.162441 26.07969 curveto
15.883639 26.07969 15.657365 25.853416 15.657365 25.574614 curveto
15.657365 25.295811 15.883639 25.069537 16.162441 25.069537 curveto
16.441243 25.069537 16.667518 25.295811 16.667518 25.574614 curveto
closepath
eofill
grestore
grestore
grestore
gsave [1 0 0 1 0 0] concat
gsave
0 0 0 setrgbcolor
newpath
368.74249 694.28381 moveto
371.20392 694.28381 lineto
371.20392 718.89809 lineto
368.74249 718.89809 lineto
368.74249 694.28381 lineto
closepath
eofill
grestore
grestore
gsave [1 0 0 1 0 0] concat
gsave
0 0 0 setrgbcolor
newpath
373.66541 694.28381 moveto
376.12683 694.28381 lineto
376.12683 718.89809 lineto
373.66541 718.89809 lineto
373.66541 694.28381 lineto
closepath
eofill
grestore
grestore
gsave [1 0 0 1 0 0] concat
gsave
0 0 0 setrgbcolor
newpath
378.58826 694.28381 moveto
381.04968 694.28381 lineto
381.04968 718.89809 lineto
378.58826 718.89809 lineto
378.58826 694.28381 lineto
closepath
eofill
grestore
grestore
gsave [1 0 0 1 0 0] concat
gsave
0 0 0 setrgbcolor
newpath
383.51105 694.28381 moveto
385.97247 694.28381 lineto
385.97247 718.89809 lineto
383.51105 718.89809 lineto
383.51105 694.28381 lineto
closepath
eofill
grestore
grestore
gsave [1 0 0 1 0 0] concat
gsave
0 0 0 setrgbcolor
newpath
388.43393 694.28381 moveto
390.89535 694.28381 lineto
390.89535 718.89809 lineto
388.43393 718.89809 lineto
388.43393 694.28381 lineto
closepath
eofill
grestore
grestore
gsave [1 0 0 1 0 0] concat
gsave
0 0 0 setrgbcolor
newpath
393.35678 694.28381 moveto
395.81821 694.28381 lineto
395.81821 718.89809 lineto
393.35678 718.89809 lineto
393.35678 694.28381 lineto
closepath
eofill
grestore
grestore
grestore
0 0 0 setrgbcolor
[] 0 setdash
1 setlinewidth
0 setlinejoin
0 setlinecap
newpath
120.58596 558.37637 moveto
305.34352 798.26049 263.06912 477.91956 597.80358 555.23843 curveto
stroke
gsave [0.77947597 0.18004779 -0.18004779 0.77947597 597.80358 555.23843] concat
gsave
0 0 0 setrgbcolor
newpath
5.77 0 moveto
-2.88 5 lineto
-2.88 -5 lineto
5.77 0 lineto
closepath
eofill
grestore
0 0 0 setrgbcolor
[] 0 setdash
1.25 setlinewidth
0 setlinejoin
0 setlinecap
newpath
5.77 0 moveto
-2.88 5 lineto
-2.88 -5 lineto
5.77 0 lineto
closepath
stroke
grestore
0 0 0 setrgbcolor
[] 0 setdash
1 setlinewidth
0 setlinejoin
0 setlinecap
newpath
143.72048 563.14567 moveto
245.18963 532.94847 432.91397 504.83591 598.49816 543.17778 curveto
stroke
gsave [0.77937854 0.1804691 -0.1804691 0.77937854 598.49816 543.17778] concat
gsave
0 0 0 setrgbcolor
newpath
5.77 0 moveto
-2.88 5 lineto
-2.88 -5 lineto
5.77 0 lineto
closepath
eofill
grestore
0 0 0 setrgbcolor
[] 0 setdash
1.25 setlinewidth
0 setlinejoin
0 setlinecap
newpath
5.77 0 moveto
-2.88 5 lineto
-2.88 -5 lineto
5.77 0 lineto
closepath
stroke
grestore
gsave [0.8427219 0 0 0.8427219 55.13947 450.0306] concat
gsave
1 1 1 setrgbcolor
newpath
98.257646 116.15549 moveto
27.046518 117.04537 lineto
27.470269 167.57752 lineto
33.784136 167.32327 lineto
33.805325 167.64108 lineto
27.15245 167.70464 lineto
27.34314 171.00989 lineto
12.639028 189.69725 lineto
11.876276 192.34569 lineto
11.876276 196.77387 lineto
11.876276 197.97335 13.382168 198.83764 14.418776 198.82905 curveto
114.0847 198.00275 lineto
115.19195 197.99359 116.37839 196.35088 116.24582 195.07887 curveto
115.88564 191.62531 lineto
113.72452 188.70144 lineto
99.211086 170.67089 lineto
99.126336 167.02664 lineto
98.215276 167.02664 lineto
98.257646 116.15549 lineto
closepath
54.886876 166.98427 moveto
54.886876 167.45039 lineto
51.030746 167.47158 lineto
51.051936 167.28089 lineto
54.886876 166.98427 lineto
closepath
92.028526 166.98427 moveto
93.935406 167.06902 lineto
92.028526 167.09021 lineto
92.028526 166.98427 lineto
closepath
eofill
grestore
gsave
<<
/ShadingType 2
/ColorSpace /DeviceRGB
/Coords [44.94112 141.61659 43.214127 303.09018]
/Extend [true true]
/Domain [0 1]
/Function <<
/FunctionType 3
/Functions
[
<<
/FunctionType 2
/Domain [0 1]
/C0 [0.81960785 0.81960785 0.81960785]
/C1 [1 0.99215686 0.97254902]
/N 1
>>
]
/Domain [0 1]
/Bounds [ ]
/Encode [ 0 1 ]
>>
>>
newpath
27.22217 167.67501 moveto
27.423913 170.97861 lineto
12.709435 189.66927 lineto
11.945119 192.32243 lineto
11.945119 196.74437 lineto
11.945119 197.94385 13.456239 198.81652 14.492847 198.80794 curveto
114.16896 197.98333 lineto
115.27621 197.97416 116.46335 196.33699 116.33078 195.06499 curveto
115.97048 191.60765 lineto
113.80866 188.68933 lineto
99.284576 170.65792 lineto
99.215066 167.01031 lineto
27.22217 167.67501 lineto
closepath
eoclip
gsave [1.1947278 0 0 0.3704654 10.65696 103.67234] concat
shfill
grestore
grestore
0 0 0 setrgbcolor
[] 0 setdash
1.5 setlinewidth
0 setlinejoin
0 setlinecap
newpath
27.22217 167.67501 moveto
27.423913 170.97861 lineto
12.709435 189.66927 lineto
11.945119 192.32243 lineto
11.945119 196.74437 lineto
11.945119 197.94385 13.456239 198.81652 14.492847 198.80794 curveto
114.16896 197.98333 lineto
115.27621 197.97416 116.46335 196.33699 116.33078 195.06499 curveto
115.97048 191.60765 lineto
113.80866 188.68933 lineto
99.284576 170.65792 lineto
99.215066 167.01031 lineto
27.22217 167.67501 lineto
closepath
stroke
gsave
<<
/ShadingType 2
/ColorSpace /DeviceRGB
/Coords [143.64958 256.57437 52.780895 -3.6267843]
/Extend [true true]
/Domain [0 1]
/Function <<
/FunctionType 3
/Functions
[
<<
/FunctionType 2
/Domain [0 1]
/C0 [0.81960785 0.81960785 0.81960785]
/C1 [1 0.99215686 0.97254902]
/N 1
>>
]
/Domain [0 1]
/Bounds [ ]
/Encode [ 0 1 ]
>>
>>
newpath
27.541933 167.55964 moveto
27.125034 117.02743 lineto
98.328706 116.14304 lineto
98.292936 167.26483 lineto
92.102226 166.97004 lineto
92.102226 170.50759 lineto
54.957956 170.21279 lineto
54.957956 166.97004 lineto
51.125606 167.26483 lineto
50.830806 170.50759 lineto
34.027449 170.50759 lineto
33.85476 167.3006 lineto
27.541933 167.55964 lineto
closepath
eoclip
gsave [0.7610425 0 0 0.5815778 10.65696 103.67234] concat
shfill
grestore
grestore
0 0 0 setrgbcolor
[] 0 setdash
1 setlinewidth
0 setlinejoin
0 setlinecap
newpath
27.541933 167.55964 moveto
27.125034 117.02743 lineto
98.328706 116.14304 lineto
98.292936 167.26483 lineto
92.102226 166.97004 lineto
92.102226 170.50759 lineto
54.957956 170.21279 lineto
54.957956 166.97004 lineto
51.125606 167.26483 lineto
50.830806 170.50759 lineto
34.027449 170.50759 lineto
33.85476 167.3006 lineto
27.541933 167.55964 lineto
closepath
stroke
gsave
<<
/ShadingType 2
/ColorSpace /DeviceRGB
/Coords [81.80397 95.713501 65.918472 3.0277245]
/Extend [true true]
/Domain [0 1]
/Function <<
/FunctionType 3
/Functions
[
<<
/FunctionType 2
/Domain [0 1]
/C0 [0.82352942 0.82352942 0.82352942]
/C1 [0.51372552 0.51372552 0.51372552]
/N 1
>>
<<
/FunctionType 2
/Domain [0 1]
/C0 [0.51372552 0.51372552 0.51372552]
/C1 [0.42352942 0.42352942 0.42352942]
/N 1
>>
]
/Domain [0 1]
/Bounds [ 0.76209301 ]
/Encode [ 0 1 0 1 ]
>>
>>
newpath
30.282267 119.78153 moveto
30.696399 167.21553 lineto
95.414136 166.90868 lineto
95.121286 119.34759 lineto
30.282267 119.78153 lineto
closepath
eoclip
gsave [0.8934367 0 0 0.6587905 4.486454 96.980844] concat
shfill
grestore
grestore
gsave
<<
/ShadingType 2
/ColorSpace /DeviceRGB
/Coords [65.754402 374.95914 39.920727 226.36694]
/Extend [true true]
/Domain [0 1]
/Function <<
/FunctionType 3
/Functions
[
<<
/FunctionType 2
/Domain [0 1]
/C0 [0.61176473 0.59215689 0.53725493]
/C1 [0.91764706 0.90980393 0.89019608]
/N 1
>>
]
/Domain [0 1]
/Bounds [ ]
/Encode [ 0 1 ]
>>
>>
newpath
30.297263 171.63201 moveto
20.850289 184.93718 lineto
18.953813 187.60819 21.217297 188.27769 22.291505 188.27242 curveto
107.32319 187.85551 lineto
108.08277 187.85178 110.08628 188.08193 108.0438 185.35408 curveto
97.963346 171.89104 lineto
30.297263 171.63201 lineto
closepath
eoclip
gsave [1.5369989 0 0 0.2879673 10.65696 103.67234] concat
shfill
grestore
grestore
gsave
<<
/ShadingType 2
/ColorSpace /DeviceRGB
/Coords [47.717304 215.10109 48.201408 166.98875]
/Extend [true true]
/Domain [0 1]
/Function <<
/FunctionType 3
/Functions
[
<<
/FunctionType 2
/Domain [0 1]
/C0 [0 0 0]
/C1 [0 0 0]
/N 1
>>
<<
/FunctionType 2
/Domain [0 1]
/C0 [0 0 0]
/C1 [0 0 0]
/N 1
>>
]
/Domain [0 1]
/Bounds [ 0.64999998 ]
/Encode [ 0 1 0 1 ]
>>
>>
newpath
52.924286 188.05159 moveto
54.844276 182.18945 lineto
71.228156 182.18945 lineto
73.276146 187.90861 lineto
52.924286 188.05159 lineto
closepath
eoclip
gsave [0.8243215 0 0 0.2374376 27.077979 132.9201] concat
shfill
grestore
grestore
gsave
0.63529414 0.62352943 0.59607846 setrgbcolor
newpath
30.060105 172.05892 moveto
23.839864 180.46513 lineto
103.11243 180.73323 lineto
96.326376 171.86565 lineto
30.060105 172.05892 lineto
closepath
eofill
grestore
1 1 1 setrgbcolor
[] 0 setdash
1.6657649 setlinewidth
1 setlinejoin
1 setlinecap
newpath
12.964209 191.2296 moveto
114.61873 190.93479 lineto
stroke
gsave
<<
/ShadingType 2
/ColorSpace /DeviceRGB
/Coords [-13.034105 -21.764627 95.627167 66.445259]
/Extend [true true]
/Domain [0 1]
/Function <<
/FunctionType 3
/Functions
[
<<
/FunctionType 2
/Domain [0 1]
/C0 [1 1 1]
/C1 [1 1 1]
/N 1
>>
]
/Domain [0 1]
/Bounds [ ]
/Encode [ 0 1 ]
>>
>>
newpath
36.211308 154.84449 moveto
36.211308 154.84449 40.040425 141.72821 60.774256 146.43252 curveto
80.794746 150.97499 83.318346 132.63689 88.702016 132.30041 curveto
88.702016 161.23758 lineto
35.87483 161.57407 lineto
36.211308 154.84449 lineto
closepath
eoclip
gsave [0.893714 0 0 0.4952428 10.65696 103.67234] concat
shfill
grestore
grestore
gsave
<<
/ShadingType 2
/ColorSpace /DeviceRGB
/Coords [18.973362 425.61209 19.133505 399.10776]
/Extend [true true]
/Domain [0 1]
/Function <<
/FunctionType 3
/Functions
[
<<
/FunctionType 2
/Domain [0 1]
/C0 [1 1 1]
/C1 [1 1 1]
/N 1
>>
]
/Domain [0 1]
/Bounds [ ]
/Encode [ 0 1 ]
>>
>>
newpath
50.198466 166.96667 moveto
34.686926 167.70901 lineto
34.808589 170.06398 lineto
50.198466 169.92319 lineto
50.198466 166.96667 lineto
closepath
91.060266 167.12026 moveto
55.096476 167.41463 lineto
55.229216 170.06398 lineto
91.447406 170.21757 lineto
91.060266 167.12026 lineto
closepath
eoclip
gsave [2.7799024 0 0 0.1592161 10.65696 103.67234] concat
shfill
grestore
grestore
grestore
gsave [1 0 0 1 70.525713 408.85194] concat
gsave [1 0 0 -1 20.125 222.08599] concat
gsave
/newlatin1font {findfont dup length dict copy dup /Encoding ISOLatin1Encoding put definefont} def
/BitstreamVeraSans-Roman-ISOLatin1 /BitstreamVeraSans-Roman newlatin1font
12 scalefont
setfont
0 0 0 setrgbcolor
newpath
0 0 moveto
(Client) show
grestore
grestore
grestore
gsave [0.1405411 0 0 0.1405411 266.1417 493.43277] concat
gsave
0.78039217 0.78039217 0.78039217 setrgbcolor
newpath
-428.02606 18.590293 moveto
-433.39534 27.571843 -431.73552 456.06701 -424.80285 472.95478 curveto
-419.31524 486.32238 -243.14736 636.58761 -233.90157 640.60593 curveto
-114.7888 639.77431 -34.47582 595.25614 -21.127974 571.73764 curveto
-16.049686 542.1567 -20.359803 86.281263 -25.228659 76.718374 curveto
-29.427066 68.47232 -254.90166 -14.497036 -262.77612 -16.383812 curveto
-269.86082 -18.081343 -422.05787 8.6069133 -428.02606 18.590293 curveto
closepath
eofill
grestore
0.67843139 0.67843139 0.67843139 setrgbcolor
[] 0 setdash
6.632 setlinewidth
0 setlinejoin
0 setlinecap
newpath
-428.02606 18.590293 moveto
-433.39534 27.571843 -431.73552 456.06701 -424.80285 472.95478 curveto
-419.31524 486.32238 -243.14736 636.58761 -233.90157 640.60593 curveto
-114.7888 639.77431 -34.47582 595.25614 -21.127974 571.73764 curveto
-16.049686 542.1567 -20.359803 86.281263 -25.228659 76.718374 curveto
-29.427066 68.47232 -254.90166 -14.497036 -262.77612 -16.383812 curveto
-269.86082 -18.081343 -422.05787 8.6069133 -428.02606 18.590293 curveto
closepath
stroke
gsave
1 1 1 setrgbcolor
newpath
-419.39583 27.442931 moveto
-360.8901 52.84743 -296.11459 93.823663 -230.85821 126.15665 curveto
-169.02805 111.07527 -79.697448 90.919343 -34.693073 82.836101 curveto
-92.636234 101.31208 -168.72982 118.5756 -226.67298 137.05161 curveto
-230.04831 276.19898 -228.42001 487.03632 -231.79534 626.18369 curveto
-233.48301 485.88157 -238.14064 271.67257 -239.82831 131.37042 curveto
-302.27191 96.727934 -363.70289 65.549667 -419.39583 27.442931 curveto
closepath
eofill
grestore
gsave
0 0 0 setrgbcolor
newpath
-56.552751 485.86932 moveto
-77.958147 517.44601 -145.34288 533.05022 -177.34817 520.2828 curveto
-171.80579 518.76418 -63.727207 488.27359 -56.552751 485.86932 curveto
closepath
eofill
grestore
gsave [2.3627308 0 0 2.424975 -1280.3585 -398.68941] concat
gsave
1 1 1 setrgbcolor
newpath
471.29127 340.59039 moveto
513.55921 324.30516 lineto
517.9002 325.84805 517.04588 332.27818 517.04588 332.27818 curveto
510.46155 334.58088 lineto
510.46155 334.58088 501.26764 349.01224 484.93096 343.36795 curveto
484.93096 343.36795 472.7787 345.52605 471.29127 340.59039 curveto
closepath
eofill
grestore
gsave
0.3764706 0.3764706 0.3764706 setrgbcolor
newpath
471.66824 335.10501 moveto
485.70133 331.45482 499.73443 327.80464 513.76752 324.15445 curveto
514.30594 326.13864 514.34437 328.99782 513.50779 330.48201 curveto
511.36566 331.50652 507.10221 332.35425 504.96008 333.37876 curveto
498.80357 339.27354 493.45917 339.80363 483.65919 338.95243 curveto
479.87505 339.74603 476.0909 340.36284 472.30676 341.15644 curveto
471.15285 338.85897 470.82215 337.90248 471.66824 335.10501 curveto
closepath
eofill
grestore
grestore
gsave
1 1 1 setrgbcolor
newpath
-423.08516 24.431839 moveto
-229.68901 135.80224 lineto
-230.46498 633.86637 lineto
-419.74374 470.25809 lineto
-423.08516 24.431839 lineto
closepath
eofill
grestore
gsave
0 0 0 setrgbcolor
newpath
-67.775723 517.394 moveto
-90.063079 547.56794 -134.65709 552.75862 -159.62769 543.56176 curveto
-155.41328 542.40701 -73.231103 519.22219 -67.775723 517.394 curveto
closepath
eofill
grestore
gsave
0 0 0 setrgbcolor
newpath
-84.314838 548.31243 moveto
-97.206748 566.17339 -122.11555 571.69898 -141.9072 564.71996 curveto
-139.26473 563.99591 -87.735434 549.45874 -84.314838 548.31243 curveto
closepath
eofill
grestore
gsave
0.98823529 0.98823529 0.98823529 setrgbcolor
newpath
-49.755033 116.99379 moveto
-39.907431 118.37122 lineto
-38.135383 356.35606 lineto
-190.11632 399.95631 lineto
-193.86063 387.32649 lineto
-47.830967 347.36641 lineto
-49.755033 116.99379 lineto
closepath
eofill
grestore
gsave
0 0 0 setrgbcolor
newpath
-193.06725 205.18516 moveto
-192.84357 211.87986 lineto
-49.949013 169.57729 lineto
-193.06725 205.18516 lineto
closepath
eofill
grestore
gsave
0 0 0 setrgbcolor
newpath
-195.15562 253.6259 moveto
-194.93194 260.3206 lineto
-52.037384 218.01803 lineto
-195.15562 253.6259 lineto
closepath
eofill
grestore
gsave
0 0 0 setrgbcolor
newpath
-193.06725 298.343 moveto
-192.84357 305.0377 lineto
-49.949013 262.73513 lineto
-193.06725 298.343 lineto
closepath
eofill
grestore
gsave
0 0 0 setrgbcolor
newpath
-193.06725 342.36248 moveto
-192.84357 349.05718 lineto
-49.949013 306.75461 lineto
-193.06725 342.36248 lineto
closepath
eofill
grestore
0.61960787 0.61960787 0.61960787 setrgbcolor
[] 0 setdash
6.2522154 setlinewidth
0 setlinejoin
0 setlinecap
newpath
-50.518408 121.3133 moveto
-193.50684 157.97167 lineto
-192.32105 399.49356 lineto
stroke
grestore
gsave [1.8359161 0 0 1.6187775 315.18588 620.89961] concat
gsave
0.82745099 0.83529413 0.82352942 setrgbcolor
newpath
-26.263968 29.716238 moveto
-26.263968 31.890894 -30.472667 33.655833 -35.658386 33.655833 curveto
-40.844105 33.655833 -45.052805 31.890894 -45.052805 29.716238 curveto
-45.052805 27.541582 -40.844105 25.776643 -35.658386 25.776643 curveto
-30.472667 25.776643 -26.263968 27.541582 -26.263968 29.716238 curveto
closepath
eofill
grestore
0.29411766 0.3019608 0.29019609 setrgbcolor
[] 0 setdash
1 setlinewidth
0 setlinejoin
0 setlinecap
newpath
-26.263968 29.716238 moveto
-26.263968 31.890894 -30.472667 33.655833 -35.658386 33.655833 curveto
-40.844105 33.655833 -45.052805 31.890894 -45.052805 29.716238 curveto
-45.052805 27.541582 -40.844105 25.776643 -35.658386 25.776643 curveto
-30.472667 25.776643 -26.263968 27.541582 -26.263968 29.716238 curveto
closepath
stroke
grestore
gsave [1.7262623 0 0 1.5220928 311.27578 622.62808] concat
0.56470591 0.57647061 0.56078434 setrgbcolor
[] 0 setdash
1 setlinewidth
0 setlinejoin
0 setlinecap
newpath
-26.263968 29.716238 moveto
-26.263968 31.890894 -30.472667 33.655833 -35.658386 33.655833 curveto
-40.844105 33.655833 -45.052805 31.890894 -45.052805 29.716238 curveto
-45.052805 27.541582 -40.844105 25.776643 -35.658386 25.776643 curveto
-30.472667 25.776643 -26.263968 27.541582 -26.263968 29.716238 curveto
closepath
stroke
grestore
gsave [1.7262623 0 0 1.5220928 311.27578 621.41401] concat
grestore
gsave
0.81568629 0.81568629 0.81568629 setrgbcolor
newpath
256.7195 662.28012 moveto
256.60475 663.8989 lineto
256.60475 663.8989 264.54345 669.72515 273.128 670.70183 curveto
277.42028 671.19017 281.85535 671.83888 285.52043 672.62413 curveto
289.18552 673.40938 292.10836 674.43652 293.09359 675.30522 curveto
293.66347 675.80771 293.9217 676.23382 294.01155 676.56989 curveto
294.10139 676.90597 294.08171 677.14426 293.83943 677.48046 curveto
293.35487 678.15285 291.8569 679.04687 289.30701 679.75686 curveto
284.20723 681.17685 275.13296 682.08386 262.57149 682.08386 curveto
262.57149 683.70263 lineto
275.23196 683.70263 284.35218 682.84845 289.82337 681.32505 curveto
292.55895 680.56336 294.45894 679.68088 295.38848 678.39102 curveto
295.85326 677.74609 296.0445 676.95281 295.84746 676.21578 curveto
295.65043 675.47876 295.14145 674.78389 294.41315 674.14172 curveto
292.80201 672.72113 289.75573 671.86501 285.97941 671.05593 curveto
282.2031 670.24685 277.6889 669.57584 273.35749 669.08305 curveto
264.69467 668.09747 256.7195 662.28012 256.7195 662.28012 curveto
closepath
eofill
grestore
0.59215689 0.59215689 0.59215689 setrgbcolor
[] 0 setdash
0.68957257 setlinewidth
1 setlinejoin
0 setlinecap
newpath
256.7195 662.28012 moveto
256.60475 663.8989 lineto
256.60475 663.8989 264.54345 669.72515 273.128 670.70183 curveto
277.42028 671.19017 281.85535 671.83888 285.52043 672.62413 curveto
289.18552 673.40938 292.10836 674.43652 293.09359 675.30522 curveto
293.66347 675.80771 293.9217 676.23382 294.01155 676.56989 curveto
294.10139 676.90597 294.08171 677.14426 293.83943 677.48046 curveto
293.35487 678.15285 291.8569 679.04687 289.30701 679.75686 curveto
284.20723 681.17685 275.13296 682.08386 262.57149 682.08386 curveto
262.57149 683.70263 lineto
275.23196 683.70263 284.35218 682.84845 289.82337 681.32505 curveto
292.55895 680.56336 294.45894 679.68088 295.38848 678.39102 curveto
295.85326 677.74609 296.0445 676.95281 295.84746 676.21578 curveto
295.65043 675.47876 295.14145 674.78389 294.41315 674.14172 curveto
292.80201 672.72113 289.75573 671.86501 285.97941 671.05593 curveto
282.2031 670.24685 277.6889 669.57584 273.35749 669.08305 curveto
264.69467 668.09747 256.7195 662.28012 256.7195 662.28012 curveto
closepath
stroke
gsave
0.80000001 0.80000001 0.80000001 setrgbcolor
newpath
223.17332 619.19733 moveto
276.26684 619.19733 lineto
277.90216 619.19733 279.18123 620.11213 279.25769 621.3948 curveto
281.64793 661.49734 lineto
281.75239 663.24977 280.03106 664.66486 278.02266 664.66486 curveto
221.41749 664.66486 lineto
219.40909 664.66486 217.68777 663.24977 217.79222 661.49734 curveto
220.18247 621.3948 lineto
220.25475 620.18201 221.16491 619.19733 223.17332 619.19733 curveto
closepath
eofill
grestore
0.42352942 0.42352942 0.42352942 setrgbcolor
[] 0 setdash
1 setlinewidth
0 setlinejoin
0 setlinecap
newpath
223.17332 619.19733 moveto
276.26684 619.19733 lineto
277.90216 619.19733 279.18123 620.11213 279.25769 621.3948 curveto
281.64793 661.49734 lineto
281.75239 663.24977 280.03106 664.66486 278.02266 664.66486 curveto
221.41749 664.66486 lineto
219.40909 664.66486 217.68777 663.24977 217.79222 661.49734 curveto
220.18247 621.3948 lineto
220.25475 620.18201 221.16491 619.19733 223.17332 619.19733 curveto
closepath
stroke
gsave
<<
/ShadingType 2
/ColorSpace /DeviceRGB
/Coords [19.150396 32.622238 16.315819 8.8666229]
/Extend [true true]
/Domain [0 1]
/Function <<
/FunctionType 3
/Functions
[
<<
/FunctionType 2
/Domain [0 1]
/C0 [0.87450981 0.87450981 0.87058824]
/C1 [0.6156863 0.62352943 0.60392159]
/N 1
>>
]
/Domain [0 1]
/Bounds [ ]
/Encode [ 0 1 ]
>>
>>
newpath
225.00044 622.68415 moveto
222.71988 658.37061 lineto
273.48367 658.37061 lineto
271.0327 622.8354 lineto
225.00044 622.68415 lineto
closepath
eoclip
gsave [2.1556206 0 0 1.5304425 210.88462 613.55854] concat
shfill
grestore
grestore
0.47450981 0.47450981 0.47450981 setrgbcolor
[] 0 setdash
0.86196572 setlinewidth
1 setlinejoin
0 setlinecap
newpath
225.00044 622.68415 moveto
222.71988 658.37061 lineto
273.48367 658.37061 lineto
271.0327 622.8354 lineto
225.00044 622.68415 lineto
closepath
stroke
gsave
0.84705883 0.84705883 0.84705883 setrgbcolor
newpath
221.76458 676.02952 moveto
277.23829 676.02952 lineto
279.241 676.02952 278.98711 676.43398 279.19265 676.9427 curveto
284.26479 689.49624 lineto
284.47033 690.00496 284.31313 690.40942 282.31041 690.40942 curveto
216.69245 690.40942 lineto
214.68974 690.40942 214.53255 690.00496 214.73809 689.49624 curveto
219.81023 676.9427 lineto
220.01577 676.43398 219.76187 676.02952 221.76458 676.02952 curveto
closepath
eofill
grestore
0.42352942 0.42352942 0.42352942 setrgbcolor
[] 0 setdash
1 setlinewidth
0 setlinejoin
0 setlinecap
newpath
221.76458 676.02952 moveto
277.23829 676.02952 lineto
279.241 676.02952 278.98711 676.43398 279.19265 676.9427 curveto
284.26479 689.49624 lineto
284.47033 690.00496 284.31313 690.40942 282.31041 690.40942 curveto
216.69245 690.40942 lineto
214.68974 690.40942 214.53255 690.00496 214.73809 689.49624 curveto
219.81023 676.9427 lineto
220.01577 676.43398 219.76187 676.02952 221.76458 676.02952 curveto
closepath
stroke
gsave
0.47843137 0.49019608 0.46666667 setrgbcolor
newpath
221.29401 678.56967 moveto
218.04854 686.86838 lineto
228.1095 686.86838 lineto
229.08314 683.57751 lineto
256.3451 683.57751 lineto
257.35427 686.93666 lineto
268.67789 686.93666 lineto
265.5947 678.56967 lineto
221.29401 678.56967 lineto
closepath
eofill
grestore
gsave
0.46666667 0.47058824 0.45490196 setrgbcolor
newpath
229.89451 684.14984 moveto
229.08314 686.86838 lineto
256.18283 686.86838 lineto
255.37147 684.00675 lineto
229.89451 684.14984 lineto
closepath
eofill
grestore
gsave
0.46666667 0.47843137 0.45882353 setrgbcolor
newpath
278.57659 678.56967 moveto
281.65978 686.72529 lineto
271.59882 686.58221 lineto
268.84017 678.71275 lineto
278.57659 678.56967 lineto
closepath
eofill
grestore
gsave
<<
/ShadingType 2
/ColorSpace /DeviceRGB
/Coords [27.427414 48.053638 33.358662 48.053638]
/Extend [true true]
/Domain [0 1]
/Function <<
/FunctionType 3
/Functions
[
<<
/FunctionType 2
/Domain [0 1]
/C0 [0.51764709 0.51764709 0.51764709]
/C1 [0.98823529 0.98823529 0.98823529]
/N 1
>>
]
/Domain [0 1]
/Bounds [ ]
/Encode [ 0 1 ]
>>
>>
newpath
278.57659 677.71119 moveto
281.65978 685.86681 lineto
271.59882 685.72373 lineto
268.84017 677.85427 lineto
278.57659 677.71119 lineto
closepath
eoclip
gsave [2.1613691 0 0 1.3750264 209.55941 615.71397] concat
shfill
grestore
grestore
gsave
<<
/ShadingType 2
/ColorSpace /DeviceRGB
/Coords [8.1134243 88.509071 8.1134233 100.20015]
/Extend [true true]
/Domain [0 1]
/Function <<
/FunctionType 3
/Functions
[
<<
/FunctionType 2
/Domain [0 1]
/C0 [0.6156863 0.6156863 0.6156863]
/C1 [0.72549021 0.72549021 0.72549021]
/N 1
>>
]
/Domain [0 1]
/Bounds [ ]
/Encode [ 0 1 ]
>>
>>
newpath
221.29401 677.56811 moveto
218.04854 685.86681 lineto
228.1095 685.86681 lineto
229.08314 682.57595 lineto
256.3451 682.57595 lineto
257.35427 685.9351 lineto
268.67789 685.9351 lineto
265.5947 677.56811 lineto
221.29401 677.56811 lineto
closepath
eoclip
gsave [4.2406926 0 0 0.7008142 209.55941 615.71397] concat
shfill
grestore
grestore
gsave
<<
/ShadingType 2
/ColorSpace /DeviceRGB
/Coords [8.1134243 88.509071 8.1134233 100.20015]
/Extend [true true]
/Domain [0 1]
/Function <<
/FunctionType 3
/Functions
[
<<
/FunctionType 2
/Domain [0 1]
/C0 [0.6156863 0.6156863 0.6156863]
/C1 [0.72549021 0.72549021 0.72549021]
/N 1
>>
]
/Domain [0 1]
/Bounds [ ]
/Encode [ 0 1 ]
>>
>>
newpath
229.89451 683.29136 moveto
229.08314 686.0099 lineto
256.18283 686.0099 lineto
255.37147 683.14827 lineto
229.89451 683.29136 lineto
closepath
eoclip
gsave [4.2406926 0 0 0.7008142 209.55941 615.71397] concat
shfill
grestore
grestore
gsave [2.4440394 0 0 1.0658825 190.43039 620.33374] concat
gsave
<<
/ShadingType 2
/ColorSpace /DeviceRGB
/Coords [34.300991 3.9384086 35.520542 3.8451097]
/Extend [true true]
/Domain [0 1]
/Function <<
/FunctionType 3
/Functions
[
<<
/FunctionType 2
/Domain [0 1]
/C0 [0 0 0]
/C1 [0 0 0]
/N 1
>>
<<
/FunctionType 2
/Domain [0 1]
/C0 [0 0 0]
/C1 [0 0 0]
/N 1
>>
]
/Domain [0 1]
/Bounds [ 0.64999998 ]
/Encode [ 0 1 0 1 ]
>>
>>
newpath
35.620504 3.9384086 moveto
35.620504 4.4019171 35.244324 4.7780979 34.780815 4.7780979 curveto
34.317307 4.7780979 33.941126 4.4019171 33.941126 3.9384086 curveto
33.941126 3.4749001 34.317307 3.0987193 34.780815 3.0987193 curveto
35.244324 3.0987193 35.620504 3.4749001 35.620504 3.9384086 curveto
closepath
eoclip
shfill
grestore
grestore
gsave [2.4440394 0 0 1.0658825 190.63895 623.74255] concat
gsave
<<
/ShadingType 2
/ColorSpace /DeviceRGB
/Coords [34.300991 3.9384086 35.520542 3.8451097]
/Extend [true true]
/Domain [0 1]
/Function <<
/FunctionType 3
/Functions
[
<<
/FunctionType 2
/Domain [0 1]
/C0 [0 0 0]
/C1 [0 0 0]
/N 1
>>
<<
/FunctionType 2
/Domain [0 1]
/C0 [0 0 0]
/C1 [0 0 0]
/N 1
>>
]
/Domain [0 1]
/Bounds [ 0.64999998 ]
/Encode [ 0 1 0 1 ]
>>
>>
newpath
35.620504 3.9384086 moveto
35.620504 4.4019171 35.244324 4.7780979 34.780815 4.7780979 curveto
34.317307 4.7780979 33.941126 4.4019171 33.941126 3.9384086 curveto
33.941126 3.4749001 34.317307 3.0987193 34.780815 3.0987193 curveto
35.244324 3.0987193 35.620504 3.4749001 35.620504 3.9384086 curveto
closepath
eoclip
shfill
grestore
grestore
gsave [2.4440394 0 0 1.0658825 190.84751 626.9801] concat
gsave
<<
/ShadingType 2
/ColorSpace /DeviceRGB
/Coords [34.300991 3.9384086 35.520542 3.8451097]
/Extend [true true]
/Domain [0 1]
/Function <<
/FunctionType 3
/Functions
[
<<
/FunctionType 2
/Domain [0 1]
/C0 [0 0 0]
/C1 [0 0 0]
/N 1
>>
<<
/FunctionType 2
/Domain [0 1]
/C0 [0 0 0]
/C1 [0 0 0]
/N 1
>>
]
/Domain [0 1]
/Bounds [ 0.64999998 ]
/Encode [ 0 1 0 1 ]
>>
>>
newpath
35.620504 3.9384086 moveto
35.620504 4.4019171 35.244324 4.7780979 34.780815 4.7780979 curveto
34.317307 4.7780979 33.941126 4.4019171 33.941126 3.9384086 curveto
33.941126 3.4749001 34.317307 3.0987193 34.780815 3.0987193 curveto
35.244324 3.0987193 35.620504 3.4749001 35.620504 3.9384086 curveto
closepath
eoclip
shfill
grestore
grestore
gsave [2.4440394 0 0 1.0658825 191.05607 630.21766] concat
gsave
<<
/ShadingType 2
/ColorSpace /DeviceRGB
/Coords [34.300991 3.9384086 35.520542 3.8451097]
/Extend [true true]
/Domain [0 1]
/Function <<
/FunctionType 3
/Functions
[
<<
/FunctionType 2
/Domain [0 1]
/C0 [0 0 0]
/C1 [0 0 0]
/N 1
>>
<<
/FunctionType 2
/Domain [0 1]
/C0 [0 0 0]
/C1 [0 0 0]
/N 1
>>
]
/Domain [0 1]
/Bounds [ 0.64999998 ]
/Encode [ 0 1 0 1 ]
>>
>>
newpath
35.620504 3.9384086 moveto
35.620504 4.4019171 35.244324 4.7780979 34.780815 4.7780979 curveto
34.317307 4.7780979 33.941126 4.4019171 33.941126 3.9384086 curveto
33.941126 3.4749001 34.317307 3.0987193 34.780815 3.0987193 curveto
35.244324 3.0987193 35.620504 3.4749001 35.620504 3.9384086 curveto
closepath
eoclip
shfill
grestore
grestore
gsave [2.4440394 0 0 1.0658825 191.26464 633.45521] concat
gsave
<<
/ShadingType 2
/ColorSpace /DeviceRGB
/Coords [34.300991 3.9384086 35.520542 3.8451097]
/Extend [true true]
/Domain [0 1]
/Function <<
/FunctionType 3
/Functions
[
<<
/FunctionType 2
/Domain [0 1]
/C0 [0 0 0]
/C1 [0 0 0]
/N 1
>>
<<
/FunctionType 2
/Domain [0 1]
/C0 [0 0 0]
/C1 [0 0 0]
/N 1
>>
]
/Domain [0 1]
/Bounds [ 0.64999998 ]
/Encode [ 0 1 0 1 ]
>>
>>
newpath
35.620504 3.9384086 moveto
35.620504 4.4019171 35.244324 4.7780979 34.780815 4.7780979 curveto
34.317307 4.7780979 33.941126 4.4019171 33.941126 3.9384086 curveto
33.941126 3.4749001 34.317307 3.0987193 34.780815 3.0987193 curveto
35.244324 3.0987193 35.620504 3.4749001 35.620504 3.9384086 curveto
closepath
eoclip
shfill
grestore
grestore
gsave [1 0 0 1 365.27034 164.05069] concat
gsave [1 0 0 -1 20.125 222.08599] concat
gsave
/BitstreamVeraSans-Roman-ISOLatin1 findfont
12 scalefont
setfont
0 0 0 setrgbcolor
newpath
0 0 moveto
(Directory ) show
grestore
grestore
gsave [1 0 0 -1 20.125 237.08599] concat
gsave
/BitstreamVeraSans-Roman-ISOLatin1 findfont
12 scalefont
setfont
0 0 0 setrgbcolor
newpath
0 0 moveto
(Authorities) show
grestore
grestore
grestore
gsave [0.1405411 0 0 0.1405411 389.86321 504.40601] concat
gsave
0.78039217 0.78039217 0.78039217 setrgbcolor
newpath
-428.02606 18.590293 moveto
-433.39534 27.571843 -431.73552 456.06701 -424.80285 472.95478 curveto
-419.31524 486.32238 -243.14736 636.58761 -233.90157 640.60593 curveto
-114.7888 639.77431 -34.47582 595.25614 -21.127974 571.73764 curveto
-16.049686 542.1567 -20.359803 86.281263 -25.228659 76.718374 curveto
-29.427066 68.47232 -254.90166 -14.497036 -262.77612 -16.383812 curveto
-269.86082 -18.081343 -422.05787 8.6069133 -428.02606 18.590293 curveto
closepath
eofill
grestore
0.67843139 0.67843139 0.67843139 setrgbcolor
[] 0 setdash
6.632 setlinewidth
0 setlinejoin
0 setlinecap
newpath
-428.02606 18.590293 moveto
-433.39534 27.571843 -431.73552 456.06701 -424.80285 472.95478 curveto
-419.31524 486.32238 -243.14736 636.58761 -233.90157 640.60593 curveto
-114.7888 639.77431 -34.47582 595.25614 -21.127974 571.73764 curveto
-16.049686 542.1567 -20.359803 86.281263 -25.228659 76.718374 curveto
-29.427066 68.47232 -254.90166 -14.497036 -262.77612 -16.383812 curveto
-269.86082 -18.081343 -422.05787 8.6069133 -428.02606 18.590293 curveto
closepath
stroke
gsave
1 1 1 setrgbcolor
newpath
-419.39583 27.442931 moveto
-360.8901 52.84743 -296.11459 93.823663 -230.85821 126.15665 curveto
-169.02805 111.07527 -79.697448 90.919343 -34.693073 82.836101 curveto
-92.636234 101.31208 -168.72982 118.5756 -226.67298 137.05161 curveto
-230.04831 276.19898 -228.42001 487.03632 -231.79534 626.18369 curveto
-233.48301 485.88157 -238.14064 271.67257 -239.82831 131.37042 curveto
-302.27191 96.727934 -363.70289 65.549667 -419.39583 27.442931 curveto
closepath
eofill
grestore
gsave
0 0 0 setrgbcolor
newpath
-56.552751 485.86932 moveto
-77.958147 517.44601 -145.34288 533.05022 -177.34817 520.2828 curveto
-171.80579 518.76418 -63.727207 488.27359 -56.552751 485.86932 curveto
closepath
eofill
grestore
gsave [2.3627308 0 0 2.424975 -1280.3585 -398.68941] concat
gsave
1 1 1 setrgbcolor
newpath
471.29127 340.59039 moveto
513.55921 324.30516 lineto
517.9002 325.84805 517.04588 332.27818 517.04588 332.27818 curveto
510.46155 334.58088 lineto
510.46155 334.58088 501.26764 349.01224 484.93096 343.36795 curveto
484.93096 343.36795 472.7787 345.52605 471.29127 340.59039 curveto
closepath
eofill
grestore
gsave
0.3764706 0.3764706 0.3764706 setrgbcolor
newpath
471.66824 335.10501 moveto
485.70133 331.45482 499.73443 327.80464 513.76752 324.15445 curveto
514.30594 326.13864 514.34437 328.99782 513.50779 330.48201 curveto
511.36566 331.50652 507.10221 332.35425 504.96008 333.37876 curveto
498.80357 339.27354 493.45917 339.80363 483.65919 338.95243 curveto
479.87505 339.74603 476.0909 340.36284 472.30676 341.15644 curveto
471.15285 338.85897 470.82215 337.90248 471.66824 335.10501 curveto
closepath
eofill
grestore
grestore
gsave
1 1 1 setrgbcolor
newpath
-423.08516 24.431839 moveto
-229.68901 135.80224 lineto
-230.46498 633.86637 lineto
-419.74374 470.25809 lineto
-423.08516 24.431839 lineto
closepath
eofill
grestore
gsave
0 0 0 setrgbcolor
newpath
-67.775723 517.394 moveto
-90.063079 547.56794 -134.65709 552.75862 -159.62769 543.56176 curveto
-155.41328 542.40701 -73.231103 519.22219 -67.775723 517.394 curveto
closepath
eofill
grestore
gsave
0 0 0 setrgbcolor
newpath
-84.314838 548.31243 moveto
-97.206748 566.17339 -122.11555 571.69898 -141.9072 564.71996 curveto
-139.26473 563.99591 -87.735434 549.45874 -84.314838 548.31243 curveto
closepath
eofill
grestore
gsave
0.98823529 0.98823529 0.98823529 setrgbcolor
newpath
-49.755033 116.99379 moveto
-39.907431 118.37122 lineto
-38.135383 356.35606 lineto
-190.11632 399.95631 lineto
-193.86063 387.32649 lineto
-47.830967 347.36641 lineto
-49.755033 116.99379 lineto
closepath
eofill
grestore
gsave
0 0 0 setrgbcolor
newpath
-193.06725 205.18516 moveto
-192.84357 211.87986 lineto
-49.949013 169.57729 lineto
-193.06725 205.18516 lineto
closepath
eofill
grestore
gsave
0 0 0 setrgbcolor
newpath
-195.15562 253.6259 moveto
-194.93194 260.3206 lineto
-52.037384 218.01803 lineto
-195.15562 253.6259 lineto
closepath
eofill
grestore
gsave
0 0 0 setrgbcolor
newpath
-193.06725 298.343 moveto
-192.84357 305.0377 lineto
-49.949013 262.73513 lineto
-193.06725 298.343 lineto
closepath
eofill
grestore
gsave
0 0 0 setrgbcolor
newpath
-193.06725 342.36248 moveto
-192.84357 349.05718 lineto
-49.949013 306.75461 lineto
-193.06725 342.36248 lineto
closepath
eofill
grestore
0.61960787 0.61960787 0.61960787 setrgbcolor
[] 0 setdash
6.2522154 setlinewidth
0 setlinejoin
0 setlinecap
newpath
-50.518408 121.3133 moveto
-193.50684 157.97167 lineto
-192.32105 399.49356 lineto
stroke
grestore
gsave [0.1405411 0 0 0.1405411 507.67287 477.95895] concat
gsave
0.78039217 0.78039217 0.78039217 setrgbcolor
newpath
-428.02606 18.590293 moveto
-433.39534 27.571843 -431.73552 456.06701 -424.80285 472.95478 curveto
-419.31524 486.32238 -243.14736 636.58761 -233.90157 640.60593 curveto
-114.7888 639.77431 -34.47582 595.25614 -21.127974 571.73764 curveto
-16.049686 542.1567 -20.359803 86.281263 -25.228659 76.718374 curveto
-29.427066 68.47232 -254.90166 -14.497036 -262.77612 -16.383812 curveto
-269.86082 -18.081343 -422.05787 8.6069133 -428.02606 18.590293 curveto
closepath
eofill
grestore
0.67843139 0.67843139 0.67843139 setrgbcolor
[] 0 setdash
6.632 setlinewidth
0 setlinejoin
0 setlinecap
newpath
-428.02606 18.590293 moveto
-433.39534 27.571843 -431.73552 456.06701 -424.80285 472.95478 curveto
-419.31524 486.32238 -243.14736 636.58761 -233.90157 640.60593 curveto
-114.7888 639.77431 -34.47582 595.25614 -21.127974 571.73764 curveto
-16.049686 542.1567 -20.359803 86.281263 -25.228659 76.718374 curveto
-29.427066 68.47232 -254.90166 -14.497036 -262.77612 -16.383812 curveto
-269.86082 -18.081343 -422.05787 8.6069133 -428.02606 18.590293 curveto
closepath
stroke
gsave
1 1 1 setrgbcolor
newpath
-419.39583 27.442931 moveto
-360.8901 52.84743 -296.11459 93.823663 -230.85821 126.15665 curveto
-169.02805 111.07527 -79.697448 90.919343 -34.693073 82.836101 curveto
-92.636234 101.31208 -168.72982 118.5756 -226.67298 137.05161 curveto
-230.04831 276.19898 -228.42001 487.03632 -231.79534 626.18369 curveto
-233.48301 485.88157 -238.14064 271.67257 -239.82831 131.37042 curveto
-302.27191 96.727934 -363.70289 65.549667 -419.39583 27.442931 curveto
closepath
eofill
grestore
gsave
0 0 0 setrgbcolor
newpath
-56.552751 485.86932 moveto
-77.958147 517.44601 -145.34288 533.05022 -177.34817 520.2828 curveto
-171.80579 518.76418 -63.727207 488.27359 -56.552751 485.86932 curveto
closepath
eofill
grestore
gsave [2.3627308 0 0 2.424975 -1280.3585 -398.68941] concat
gsave
1 1 1 setrgbcolor
newpath
471.29127 340.59039 moveto
513.55921 324.30516 lineto
517.9002 325.84805 517.04588 332.27818 517.04588 332.27818 curveto
510.46155 334.58088 lineto
510.46155 334.58088 501.26764 349.01224 484.93096 343.36795 curveto
484.93096 343.36795 472.7787 345.52605 471.29127 340.59039 curveto
closepath
eofill
grestore
gsave
0.3764706 0.3764706 0.3764706 setrgbcolor
newpath
471.66824 335.10501 moveto
485.70133 331.45482 499.73443 327.80464 513.76752 324.15445 curveto
514.30594 326.13864 514.34437 328.99782 513.50779 330.48201 curveto
511.36566 331.50652 507.10221 332.35425 504.96008 333.37876 curveto
498.80357 339.27354 493.45917 339.80363 483.65919 338.95243 curveto
479.87505 339.74603 476.0909 340.36284 472.30676 341.15644 curveto
471.15285 338.85897 470.82215 337.90248 471.66824 335.10501 curveto
closepath
eofill
grestore
grestore
gsave
1 1 1 setrgbcolor
newpath
-423.08516 24.431839 moveto
-229.68901 135.80224 lineto
-230.46498 633.86637 lineto
-419.74374 470.25809 lineto
-423.08516 24.431839 lineto
closepath
eofill
grestore
gsave
0 0 0 setrgbcolor
newpath
-67.775723 517.394 moveto
-90.063079 547.56794 -134.65709 552.75862 -159.62769 543.56176 curveto
-155.41328 542.40701 -73.231103 519.22219 -67.775723 517.394 curveto
closepath
eofill
grestore
gsave
0 0 0 setrgbcolor
newpath
-84.314838 548.31243 moveto
-97.206748 566.17339 -122.11555 571.69898 -141.9072 564.71996 curveto
-139.26473 563.99591 -87.735434 549.45874 -84.314838 548.31243 curveto
closepath
eofill
grestore
gsave
0.98823529 0.98823529 0.98823529 setrgbcolor
newpath
-49.755033 116.99379 moveto
-39.907431 118.37122 lineto
-38.135383 356.35606 lineto
-190.11632 399.95631 lineto
-193.86063 387.32649 lineto
-47.830967 347.36641 lineto
-49.755033 116.99379 lineto
closepath
eofill
grestore
gsave
0 0 0 setrgbcolor
newpath
-193.06725 205.18516 moveto
-192.84357 211.87986 lineto
-49.949013 169.57729 lineto
-193.06725 205.18516 lineto
closepath
eofill
grestore
gsave
0 0 0 setrgbcolor
newpath
-195.15562 253.6259 moveto
-194.93194 260.3206 lineto
-52.037384 218.01803 lineto
-195.15562 253.6259 lineto
closepath
eofill
grestore
gsave
0 0 0 setrgbcolor
newpath
-193.06725 298.343 moveto
-192.84357 305.0377 lineto
-49.949013 262.73513 lineto
-193.06725 298.343 lineto
closepath
eofill
grestore
gsave
0 0 0 setrgbcolor
newpath
-193.06725 342.36248 moveto
-192.84357 349.05718 lineto
-49.949013 306.75461 lineto
-193.06725 342.36248 lineto
closepath
eofill
grestore
0.61960787 0.61960787 0.61960787 setrgbcolor
[] 0 setdash
6.2522154 setlinewidth
0 setlinejoin
0 setlinecap
newpath
-50.518408 121.3133 moveto
-193.50684 157.97167 lineto
-192.32105 399.49356 lineto
stroke
grestore
gsave [0.1405411 0 0 0.1405411 667.95815 505.20745] concat
gsave
0.78039217 0.78039217 0.78039217 setrgbcolor
newpath
-428.02606 18.590293 moveto
-433.39534 27.571843 -431.73552 456.06701 -424.80285 472.95478 curveto
-419.31524 486.32238 -243.14736 636.58761 -233.90157 640.60593 curveto
-114.7888 639.77431 -34.47582 595.25614 -21.127974 571.73764 curveto
-16.049686 542.1567 -20.359803 86.281263 -25.228659 76.718374 curveto
-29.427066 68.47232 -254.90166 -14.497036 -262.77612 -16.383812 curveto
-269.86082 -18.081343 -422.05787 8.6069133 -428.02606 18.590293 curveto
closepath
eofill
grestore
0.67843139 0.67843139 0.67843139 setrgbcolor
[] 0 setdash
6.632 setlinewidth
0 setlinejoin
0 setlinecap
newpath
-428.02606 18.590293 moveto
-433.39534 27.571843 -431.73552 456.06701 -424.80285 472.95478 curveto
-419.31524 486.32238 -243.14736 636.58761 -233.90157 640.60593 curveto
-114.7888 639.77431 -34.47582 595.25614 -21.127974 571.73764 curveto
-16.049686 542.1567 -20.359803 86.281263 -25.228659 76.718374 curveto
-29.427066 68.47232 -254.90166 -14.497036 -262.77612 -16.383812 curveto
-269.86082 -18.081343 -422.05787 8.6069133 -428.02606 18.590293 curveto
closepath
stroke
gsave
1 1 1 setrgbcolor
newpath
-419.39583 27.442931 moveto
-360.8901 52.84743 -296.11459 93.823663 -230.85821 126.15665 curveto
-169.02805 111.07527 -79.697448 90.919343 -34.693073 82.836101 curveto
-92.636234 101.31208 -168.72982 118.5756 -226.67298 137.05161 curveto
-230.04831 276.19898 -228.42001 487.03632 -231.79534 626.18369 curveto
-233.48301 485.88157 -238.14064 271.67257 -239.82831 131.37042 curveto
-302.27191 96.727934 -363.70289 65.549667 -419.39583 27.442931 curveto
closepath
eofill
grestore
gsave
0 0 0 setrgbcolor
newpath
-56.552751 485.86932 moveto
-77.958147 517.44601 -145.34288 533.05022 -177.34817 520.2828 curveto
-171.80579 518.76418 -63.727207 488.27359 -56.552751 485.86932 curveto
closepath
eofill
grestore
gsave [2.3627308 0 0 2.424975 -1280.3585 -398.68941] concat
gsave
1 1 1 setrgbcolor
newpath
471.29127 340.59039 moveto
513.55921 324.30516 lineto
517.9002 325.84805 517.04588 332.27818 517.04588 332.27818 curveto
510.46155 334.58088 lineto
510.46155 334.58088 501.26764 349.01224 484.93096 343.36795 curveto
484.93096 343.36795 472.7787 345.52605 471.29127 340.59039 curveto
closepath
eofill
grestore
gsave
0.3764706 0.3764706 0.3764706 setrgbcolor
newpath
471.66824 335.10501 moveto
485.70133 331.45482 499.73443 327.80464 513.76752 324.15445 curveto
514.30594 326.13864 514.34437 328.99782 513.50779 330.48201 curveto
511.36566 331.50652 507.10221 332.35425 504.96008 333.37876 curveto
498.80357 339.27354 493.45917 339.80363 483.65919 338.95243 curveto
479.87505 339.74603 476.0909 340.36284 472.30676 341.15644 curveto
471.15285 338.85897 470.82215 337.90248 471.66824 335.10501 curveto
closepath
eofill
grestore
grestore
gsave
1 1 1 setrgbcolor
newpath
-423.08516 24.431839 moveto
-229.68901 135.80224 lineto
-230.46498 633.86637 lineto
-419.74374 470.25809 lineto
-423.08516 24.431839 lineto
closepath
eofill
grestore
gsave
0 0 0 setrgbcolor
newpath
-67.775723 517.394 moveto
-90.063079 547.56794 -134.65709 552.75862 -159.62769 543.56176 curveto
-155.41328 542.40701 -73.231103 519.22219 -67.775723 517.394 curveto
closepath
eofill
grestore
gsave
0 0 0 setrgbcolor
newpath
-84.314838 548.31243 moveto
-97.206748 566.17339 -122.11555 571.69898 -141.9072 564.71996 curveto
-139.26473 563.99591 -87.735434 549.45874 -84.314838 548.31243 curveto
closepath
eofill
grestore
gsave
0.98823529 0.98823529 0.98823529 setrgbcolor
newpath
-49.755033 116.99379 moveto
-39.907431 118.37122 lineto
-38.135383 356.35606 lineto
-190.11632 399.95631 lineto
-193.86063 387.32649 lineto
-47.830967 347.36641 lineto
-49.755033 116.99379 lineto
closepath
eofill
grestore
gsave
0 0 0 setrgbcolor
newpath
-193.06725 205.18516 moveto
-192.84357 211.87986 lineto
-49.949013 169.57729 lineto
-193.06725 205.18516 lineto
closepath
eofill
grestore
gsave
0 0 0 setrgbcolor
newpath
-195.15562 253.6259 moveto
-194.93194 260.3206 lineto
-52.037384 218.01803 lineto
-195.15562 253.6259 lineto
closepath
eofill
grestore
gsave
0 0 0 setrgbcolor
newpath
-193.06725 298.343 moveto
-192.84357 305.0377 lineto
-49.949013 262.73513 lineto
-193.06725 298.343 lineto
closepath
eofill
grestore
gsave
0 0 0 setrgbcolor
newpath
-193.06725 342.36248 moveto
-192.84357 349.05718 lineto
-49.949013 306.75461 lineto
-193.06725 342.36248 lineto
closepath
eofill
grestore
0.61960787 0.61960787 0.61960787 setrgbcolor
[] 0 setdash
6.2522154 setlinewidth
0 setlinejoin
0 setlinecap
newpath
-50.518408 121.3133 moveto
-193.50684 157.97167 lineto
-192.32105 399.49356 lineto
stroke
grestore
gsave [1 0 0 1 574.51979 389.67105] concat
gsave [1 0 0 -1 28.257812 222.08599] concat
gsave
/BitstreamVeraSans-Roman-ISOLatin1 findfont
12 scalefont
setfont
0 0 0 setrgbcolor
newpath
0 0 moveto
(Third-party ) show
grestore
grestore
gsave [1 0 0 -1 42.601562 237.08599] concat
gsave
/BitstreamVeraSans-Roman-ISOLatin1 findfont
12 scalefont
setfont
0 0 0 setrgbcolor
newpath
0 0 moveto
(server) show
grestore
grestore
grestore
gsave [1 0 0 1 376.56748 319.14553] concat
gsave [1 0 0 -1 20.125 222.08599] concat
gsave
/BitstreamVeraSans-Roman-ISOLatin1 findfont
12 scalefont
setfont
0 0 0 setrgbcolor
newpath
0 0 moveto
(Relays) show
grestore
grestore
grestore
0 0 0 setrgbcolor
[] 0 setdash
1 setlinewidth
0 setlinejoin
0 setlinecap
newpath
248.01275 495.06368 moveto
259.12622 480.06535 280.92984 459.72329 307.68725 448.64872 curveto
stroke
gsave [0.73918869 -0.3059413 0.3059413 0.73918869 307.68725 448.64872] concat
gsave
0 0 0 setrgbcolor
newpath
5.77 0 moveto
-2.88 5 lineto
-2.88 -5 lineto
5.77 0 lineto
closepath
eofill
grestore
0 0 0 setrgbcolor
[] 0 setdash
1.25 setlinewidth
0 setlinejoin
0 setlinecap
newpath
5.77 0 moveto
-2.88 5 lineto
-2.88 -5 lineto
5.77 0 lineto
closepath
stroke
grestore
0 0 0 setrgbcolor
[] 0 setdash
1 setlinewidth
0 setlinejoin
0 setlinecap
newpath
349.01846 498.35684 moveto
344.12775 479.63814 339.73349 464.86276 331.75604 450.33903 curveto
stroke
gsave [-0.38514198 -0.70118874 0.70118874 -0.38514198 331.75604 450.33903] concat
gsave
0 0 0 setrgbcolor
newpath
5.77 0 moveto
-2.88 5 lineto
-2.88 -5 lineto
5.77 0 lineto
closepath
eofill
grestore
0 0 0 setrgbcolor
[] 0 setdash
1.25 setlinewidth
0 setlinejoin
0 setlinecap
newpath
5.77 0 moveto
-2.88 5 lineto
-2.88 -5 lineto
5.77 0 lineto
closepath
stroke
grestore
0 0 0 setrgbcolor
[] 0 setdash
1 setlinewidth
0 setlinejoin
0 setlinecap
newpath
441.80607 483.93202 moveto
421.89717 463.90573 390.68904 454.17471 362.83382 447.9356 curveto
stroke
gsave [-0.78065738 -0.17485438 0.17485438 -0.78065738 362.83382 447.9356] concat
gsave
0 0 0 setrgbcolor
newpath
5.77 0 moveto
-2.88 5 lineto
-2.88 -5 lineto
5.77 0 lineto
closepath
eofill
grestore
0 0 0 setrgbcolor
[] 0 setdash
1.25 setlinewidth
0 setlinejoin
0 setlinecap
newpath
5.77 0 moveto
-2.88 5 lineto
-2.88 -5 lineto
5.77 0 lineto
closepath
stroke
grestore
gsave [1 0 0 1 145.8323 460.48372] concat
gsave [1 0 0 -1 20.125 222.08599] concat
gsave
/BitstreamVeraSans-Roman-ISOLatin1 findfont
12 scalefont
setfont
0 0 0 setrgbcolor
newpath
0 0 moveto
(Bridge) show
grestore
grestore
grestore
gsave
0.87450981 0.87450981 0.87450981 setrgbcolor
newpath
357.01081 641.07475 moveto
357.01081 720.88631 lineto
407.54993 720.88631 lineto
407.54993 640.59395 lineto
398.25171 630.4973 lineto
365.84411 630.4973 lineto
357.01081 641.07475 lineto
closepath
eofill
grestore
0.36862746 0.36862746 0.36862746 setrgbcolor
[] 0 setdash
1 setlinewidth
1 setlinejoin
1 setlinecap
newpath
357.01081 641.07475 moveto
357.01081 720.88631 lineto
407.54993 720.88631 lineto
407.54993 640.59395 lineto
398.25171 630.4973 lineto
365.84411 630.4973 lineto
357.01081 641.07475 lineto
closepath
stroke
gsave [1 0 0 1 0 0] concat
gsave
1 1 1 setrgbcolor
newpath
363.81967 647.51666 moveto
403.2025 647.51666 lineto
403.2025 657.36237 lineto
363.81967 657.36237 lineto
363.81967 647.51666 lineto
closepath
eofill
grestore
1 1 1 setrgbcolor
[] 0 setdash
2.4614267 setlinewidth
0 setlinejoin
0 setlinecap
newpath
363.81967 647.51666 moveto
403.2025 647.51666 lineto
403.2025 657.36237 lineto
363.81967 657.36237 lineto
363.81967 647.51666 lineto
closepath
stroke
grestore
gsave [1 0 0 1 0 0] concat
gsave
<<
/ShadingType 2
/ColorSpace /DeviceRGB
/Coords [27.324621 26.887815 22.311644 26.7868]
/Extend [true true]
/Domain [0 1]
/Function <<
/FunctionType 3
/Functions
[
<<
/FunctionType 2
/Domain [0 1]
/C0 [1 1 1]
/C1 [1 1 1]
/N 1
>>
]
/Domain [0 1]
/Bounds [ ]
/Encode [ 0 1 ]
>>
>>
newpath
376.12683 679.5152 moveto
403.20253 679.5152 lineto
403.20253 689.3609 lineto
376.12683 689.3609 lineto
376.12683 679.5152 lineto
closepath
eoclip
gsave [2.3751799 0 0 1.9527947 324.76378 633.50977] concat
shfill
grestore
grestore
1 1 1 setrgbcolor
[] 0 setdash
2.4614277 setlinewidth
0 setlinejoin
0 setlinecap
newpath
376.12683 679.5152 moveto
403.20253 679.5152 lineto
403.20253 689.3609 lineto
376.12683 689.3609 lineto
376.12683 679.5152 lineto
closepath
stroke
grestore
gsave
0.78431374 0.78431374 0.78431374 setrgbcolor
newpath
374.89609 678.28448 moveto
401.97177 678.28448 lineto
401.97177 688.13019 lineto
374.89609 688.13019 lineto
374.89609 678.28448 lineto
closepath
eofill
grestore
0.67450982 0.67450982 0.67450982 setrgbcolor
[] 0 setdash
2.4614263 setlinewidth
0 setlinejoin
0 setlinecap
newpath
374.89609 678.28448 moveto
401.97177 678.28448 lineto
401.97177 688.13019 lineto
374.89609 688.13019 lineto
374.89609 678.28448 lineto
closepath
stroke
gsave [1 0 0 1 0 0] concat
gsave
1 1 1 setrgbcolor
newpath
363.81967 662.28522 moveto
403.2025 662.28522 lineto
403.2025 672.13092 lineto
363.81967 672.13092 lineto
363.81967 662.28522 lineto
closepath
eofill
grestore
1 1 1 setrgbcolor
[] 0 setdash
2.4614265 setlinewidth
0 setlinejoin
0 setlinecap
newpath
363.81967 662.28522 moveto
403.2025 662.28522 lineto
403.2025 672.13092 lineto
363.81967 672.13092 lineto
363.81967 662.28522 lineto
closepath
stroke
grestore
gsave
0.78431374 0.78431374 0.78431374 setrgbcolor
newpath
362.58896 661.0545 moveto
401.9718 661.0545 lineto
401.9718 670.90021 lineto
362.58896 670.90021 lineto
362.58896 661.0545 lineto
closepath
eofill
grestore
0.67450982 0.67450982 0.67450982 setrgbcolor
[] 0 setdash
2.461427 setlinewidth
0 setlinejoin
0 setlinecap
newpath
362.58896 661.0545 moveto
401.9718 661.0545 lineto
401.9718 670.90021 lineto
362.58896 670.90021 lineto
362.58896 661.0545 lineto
closepath
stroke
gsave
0.78431374 0.78431374 0.78431374 setrgbcolor
newpath
362.58899 646.28595 moveto
401.97183 646.28595 lineto
401.97183 656.13166 lineto
362.58899 656.13166 lineto
362.58899 646.28595 lineto
closepath
eofill
grestore
0.67450982 0.67450982 0.67450982 setrgbcolor
[] 0 setdash
2.4614267 setlinewidth
0 setlinejoin
0 setlinecap
newpath
362.58899 646.28595 moveto
401.97183 646.28595 lineto
401.97183 656.13166 lineto
362.58899 656.13166 lineto
362.58899 646.28595 lineto
closepath
stroke
gsave [2.180292 0 0 2.197975 329.67902 627.54166] concat
gsave [0.779806 0 0 0.773527 -34.68981 5.595099] concat
gsave
0.78431374 0.78431374 0.78431374 setrgbcolor
newpath
68.185294 26.231213 moveto
68.185294 27.430062 67.212315 28.403041 66.013466 28.403041 curveto
64.814617 28.403041 63.841638 27.430062 63.841638 26.231213 curveto
63.841638 25.032364 64.814617 24.059385 66.013466 24.059385 curveto
67.212315 24.059385 68.185294 25.032364 68.185294 26.231213 curveto
closepath
eofill
grestore
0.59215689 0.59215689 0.59215689 setrgbcolor
[] 0 setdash
1.4477295 setlinewidth
0 setlinejoin
0 setlinecap
newpath
68.185294 26.231213 moveto
68.185294 27.430062 67.212315 28.403041 66.013466 28.403041 curveto
64.814617 28.403041 63.841638 27.430062 63.841638 26.231213 curveto
63.841638 25.032364 64.814617 24.059385 66.013466 24.059385 curveto
67.212315 24.059385 68.185294 25.032364 68.185294 26.231213 curveto
closepath
stroke
grestore
gsave [1.008603 0 0 1.000481 -0.07396387 -0.0549963] concat
gsave
1 1 1 setrgbcolor
newpath
16.667518 25.574614 moveto
16.667518 25.853416 16.441243 26.07969 16.162441 26.07969 curveto
15.883639 26.07969 15.657365 25.853416 15.657365 25.574614 curveto
15.657365 25.295811 15.883639 25.069537 16.162441 25.069537 curveto
16.441243 25.069537 16.667518 25.295811 16.667518 25.574614 curveto
closepath
eofill
grestore
grestore
grestore
gsave [1 0 0 1 0 0] concat
gsave
0 0 0 setrgbcolor
newpath
368.74249 694.28381 moveto
371.20392 694.28381 lineto
371.20392 718.89809 lineto
368.74249 718.89809 lineto
368.74249 694.28381 lineto
closepath
eofill
grestore
grestore
gsave [1 0 0 1 0 0] concat
gsave
0 0 0 setrgbcolor
newpath
373.66541 694.28381 moveto
376.12683 694.28381 lineto
376.12683 718.89809 lineto
373.66541 718.89809 lineto
373.66541 694.28381 lineto
closepath
eofill
grestore
grestore
gsave [1 0 0 1 0 0] concat
gsave
0 0 0 setrgbcolor
newpath
378.58826 694.28381 moveto
381.04968 694.28381 lineto
381.04968 718.89809 lineto
378.58826 718.89809 lineto
378.58826 694.28381 lineto
closepath
eofill
grestore
grestore
gsave [1 0 0 1 0 0] concat
gsave
0 0 0 setrgbcolor
newpath
383.51105 694.28381 moveto
385.97247 694.28381 lineto
385.97247 718.89809 lineto
383.51105 718.89809 lineto
383.51105 694.28381 lineto
closepath
eofill
grestore
grestore
gsave [1 0 0 1 0 0] concat
gsave
0 0 0 setrgbcolor
newpath
388.43393 694.28381 moveto
390.89535 694.28381 lineto
390.89535 718.89809 lineto
388.43393 718.89809 lineto
388.43393 694.28381 lineto
closepath
eofill
grestore
grestore
gsave [1 0 0 1 0 0] concat
gsave
0 0 0 setrgbcolor
newpath
393.35678 694.28381 moveto
395.81821 694.28381 lineto
395.81821 718.89809 lineto
393.35678 718.89809 lineto
393.35678 694.28381 lineto
closepath
eofill
grestore
grestore
gsave [1 0 0 1 395.00029 452.1823] concat
gsave [1 0 0 -1 20.125 222.08599] concat
gsave
/BitstreamVeraSans-Roman-ISOLatin1 findfont
12 scalefont
setfont
0 0 0 setrgbcolor
newpath
0 0 moveto
(Bridge ) show
grestore
grestore
gsave [1 0 0 -1 20.125 237.08599] concat
gsave
/BitstreamVeraSans-Roman-ISOLatin1 findfont
12 scalefont
setfont
0 0 0 setrgbcolor
newpath
0 0 moveto
(Authority) show
grestore
grestore
grestore
0 0 0 setrgbcolor
[] 0 setdash
1 setlinewidth
0 setlinejoin
0 setlinecap
newpath
285.70578 648.22357 moveto
304.68609 657.68725 324.17475 664.13482 346.98313 665.12129 curveto
stroke
gsave [0.79925281 0.034567949 -0.034567949 0.79925281 346.98313 665.12129] concat
gsave
0 0 0 setrgbcolor
newpath
5.77 0 moveto
-2.88 5 lineto
-2.88 -5 lineto
5.77 0 lineto
closepath
eofill
grestore
0 0 0 setrgbcolor
[] 0 setdash
1.25 setlinewidth
0 setlinejoin
0 setlinecap
newpath
5.77 0 moveto
-2.88 5 lineto
-2.88 -5 lineto
5.77 0 lineto
closepath
stroke
grestore
0 0 0 setrgbcolor
[] 0 setdash
1 setlinewidth
0 setlinejoin
0 setlinecap
newpath
301.30183 422.28911 moveto
209.56879 459.84597 163.027 495.02162 128.62621 536.82532 curveto
stroke
gsave [-0.50833871 0.61773113 -0.61773113 -0.50833871 128.62621 536.82532] concat
gsave
0 0 0 setrgbcolor
newpath
5.77 0 moveto
-2.88 5 lineto
-2.88 -5 lineto
5.77 0 lineto
closepath
eofill
grestore
0 0 0 setrgbcolor
[] 0 setdash
1.25 setlinewidth
0 setlinejoin
0 setlinecap
newpath
5.77 0 moveto
-2.88 5 lineto
-2.88 -5 lineto
5.77 0 lineto
closepath
stroke
grestore
gsave [1 0 0 1 -48.301609 -280.35693] concat
gsave
0.87450981 0.87450981 0.87450981 setrgbcolor
newpath
357.01081 641.07475 moveto
357.01081 720.88631 lineto
407.54993 720.88631 lineto
407.54993 640.59395 lineto
398.25171 630.4973 lineto
365.84411 630.4973 lineto
357.01081 641.07475 lineto
closepath
eofill
grestore
0.36862746 0.36862746 0.36862746 setrgbcolor
[] 0 setdash
1 setlinewidth
1 setlinejoin
1 setlinecap
newpath
357.01081 641.07475 moveto
357.01081 720.88631 lineto
407.54993 720.88631 lineto
407.54993 640.59395 lineto
398.25171 630.4973 lineto
365.84411 630.4973 lineto
357.01081 641.07475 lineto
closepath
stroke
gsave [1 0 0 1 0 0] concat
gsave
1 1 1 setrgbcolor
newpath
363.81967 647.51666 moveto
403.2025 647.51666 lineto
403.2025 657.36237 lineto
363.81967 657.36237 lineto
363.81967 647.51666 lineto
closepath
eofill
grestore
1 1 1 setrgbcolor
[] 0 setdash
2.4614267 setlinewidth
0 setlinejoin
0 setlinecap
newpath
363.81967 647.51666 moveto
403.2025 647.51666 lineto
403.2025 657.36237 lineto
363.81967 657.36237 lineto
363.81967 647.51666 lineto
closepath
stroke
grestore
gsave [1 0 0 1 0 0] concat
gsave
<<
/ShadingType 2
/ColorSpace /DeviceRGB
/Coords [27.324621 26.887815 22.311644 26.7868]
/Extend [true true]
/Domain [0 1]
/Function <<
/FunctionType 3
/Functions
[
<<
/FunctionType 2
/Domain [0 1]
/C0 [1 1 1]
/C1 [1 1 1]
/N 1
>>
]
/Domain [0 1]
/Bounds [ ]
/Encode [ 0 1 ]
>>
>>
newpath
376.12683 679.5152 moveto
403.20253 679.5152 lineto
403.20253 689.3609 lineto
376.12683 689.3609 lineto
376.12683 679.5152 lineto
closepath
eoclip
gsave [2.3751799 0 0 1.9527947 324.76378 633.50977] concat
shfill
grestore
grestore
1 1 1 setrgbcolor
[] 0 setdash
2.4614277 setlinewidth
0 setlinejoin
0 setlinecap
newpath
376.12683 679.5152 moveto
403.20253 679.5152 lineto
403.20253 689.3609 lineto
376.12683 689.3609 lineto
376.12683 679.5152 lineto
closepath
stroke
grestore
gsave
0.78431374 0.78431374 0.78431374 setrgbcolor
newpath
374.89609 678.28448 moveto
401.97177 678.28448 lineto
401.97177 688.13019 lineto
374.89609 688.13019 lineto
374.89609 678.28448 lineto
closepath
eofill
grestore
0.67450982 0.67450982 0.67450982 setrgbcolor
[] 0 setdash
2.4614263 setlinewidth
0 setlinejoin
0 setlinecap
newpath
374.89609 678.28448 moveto
401.97177 678.28448 lineto
401.97177 688.13019 lineto
374.89609 688.13019 lineto
374.89609 678.28448 lineto
closepath
stroke
gsave [1 0 0 1 0 0] concat
gsave
1 1 1 setrgbcolor
newpath
363.81967 662.28522 moveto
403.2025 662.28522 lineto
403.2025 672.13092 lineto
363.81967 672.13092 lineto
363.81967 662.28522 lineto
closepath
eofill
grestore
1 1 1 setrgbcolor
[] 0 setdash
2.4614265 setlinewidth
0 setlinejoin
0 setlinecap
newpath
363.81967 662.28522 moveto
403.2025 662.28522 lineto
403.2025 672.13092 lineto
363.81967 672.13092 lineto
363.81967 662.28522 lineto
closepath
stroke
grestore
gsave
0.78431374 0.78431374 0.78431374 setrgbcolor
newpath
362.58896 661.0545 moveto
401.9718 661.0545 lineto
401.9718 670.90021 lineto
362.58896 670.90021 lineto
362.58896 661.0545 lineto
closepath
eofill
grestore
0.67450982 0.67450982 0.67450982 setrgbcolor
[] 0 setdash
2.461427 setlinewidth
0 setlinejoin
0 setlinecap
newpath
362.58896 661.0545 moveto
401.9718 661.0545 lineto
401.9718 670.90021 lineto
362.58896 670.90021 lineto
362.58896 661.0545 lineto
closepath
stroke
gsave
0.78431374 0.78431374 0.78431374 setrgbcolor
newpath
362.58899 646.28595 moveto
401.97183 646.28595 lineto
401.97183 656.13166 lineto
362.58899 656.13166 lineto
362.58899 646.28595 lineto
closepath
eofill
grestore
0.67450982 0.67450982 0.67450982 setrgbcolor
[] 0 setdash
2.4614267 setlinewidth
0 setlinejoin
0 setlinecap
newpath
362.58899 646.28595 moveto
401.97183 646.28595 lineto
401.97183 656.13166 lineto
362.58899 656.13166 lineto
362.58899 646.28595 lineto
closepath
stroke
gsave [2.180292 0 0 2.197975 329.67902 627.54166] concat
gsave [0.779806 0 0 0.773527 -34.68981 5.595099] concat
gsave
0.78431374 0.78431374 0.78431374 setrgbcolor
newpath
68.185294 26.231213 moveto
68.185294 27.430062 67.212315 28.403041 66.013466 28.403041 curveto
64.814617 28.403041 63.841638 27.430062 63.841638 26.231213 curveto
63.841638 25.032364 64.814617 24.059385 66.013466 24.059385 curveto
67.212315 24.059385 68.185294 25.032364 68.185294 26.231213 curveto
closepath
eofill
grestore
0.59215689 0.59215689 0.59215689 setrgbcolor
[] 0 setdash
1.4477295 setlinewidth
0 setlinejoin
0 setlinecap
newpath
68.185294 26.231213 moveto
68.185294 27.430062 67.212315 28.403041 66.013466 28.403041 curveto
64.814617 28.403041 63.841638 27.430062 63.841638 26.231213 curveto
63.841638 25.032364 64.814617 24.059385 66.013466 24.059385 curveto
67.212315 24.059385 68.185294 25.032364 68.185294 26.231213 curveto
closepath
stroke
grestore
gsave [1.008603 0 0 1.000481 -0.07396387 -0.0549963] concat
gsave
1 1 1 setrgbcolor
newpath
16.667518 25.574614 moveto
16.667518 25.853416 16.441243 26.07969 16.162441 26.07969 curveto
15.883639 26.07969 15.657365 25.853416 15.657365 25.574614 curveto
15.657365 25.295811 15.883639 25.069537 16.162441 25.069537 curveto
16.441243 25.069537 16.667518 25.295811 16.667518 25.574614 curveto
closepath
eofill
grestore
grestore
grestore
gsave [1 0 0 1 0 0] concat
gsave
0 0 0 setrgbcolor
newpath
368.74249 694.28381 moveto
371.20392 694.28381 lineto
371.20392 718.89809 lineto
368.74249 718.89809 lineto
368.74249 694.28381 lineto
closepath
eofill
grestore
grestore
gsave [1 0 0 1 0 0] concat
gsave
0 0 0 setrgbcolor
newpath
373.66541 694.28381 moveto
376.12683 694.28381 lineto
376.12683 718.89809 lineto
373.66541 718.89809 lineto
373.66541 694.28381 lineto
closepath
eofill
grestore
grestore
gsave [1 0 0 1 0 0] concat
gsave
0 0 0 setrgbcolor
newpath
378.58826 694.28381 moveto
381.04968 694.28381 lineto
381.04968 718.89809 lineto
378.58826 718.89809 lineto
378.58826 694.28381 lineto
closepath
eofill
grestore
grestore
gsave [1 0 0 1 0 0] concat
gsave
0 0 0 setrgbcolor
newpath
383.51105 694.28381 moveto
385.97247 694.28381 lineto
385.97247 718.89809 lineto
383.51105 718.89809 lineto
383.51105 694.28381 lineto
closepath
eofill
grestore
grestore
gsave [1 0 0 1 0 0] concat
gsave
0 0 0 setrgbcolor
newpath
388.43393 694.28381 moveto
390.89535 694.28381 lineto
390.89535 718.89809 lineto
388.43393 718.89809 lineto
388.43393 694.28381 lineto
closepath
eofill
grestore
grestore
gsave [1 0 0 1 0 0] concat
gsave
0 0 0 setrgbcolor
newpath
393.35678 694.28381 moveto
395.81821 694.28381 lineto
395.81821 718.89809 lineto
393.35678 718.89809 lineto
393.35678 694.28381 lineto
closepath
eofill
grestore
grestore
grestore
grestore
showpage
%%EOF
