digraph ecosystem {
    node [fontname="Source Sans Pro"];
    subgraph cluster_services {
        label="Tor Project Services";
        fontname="Source Sans Pro Semi-Bold";
        webservers [label="Web Servers"];
    }
    subgraph cluster_network {
        label="Public Tor Network";
        fontname="Source Sans Pro Semi-Bold";
        relays [label="Relays"];
        bridges [label="Bridges"];
        dirauths [label="Directory Authorities"];
        bridgeauth [label="Bridge Authority"];
    }
    subgraph cluster_metrics {
        label="Tor Metrics";
        fontname="Source Sans Pro Semi-Bold";
        onionperf [label="OnionPerf"];
        subgraph resdev {
            collector [label="CollecTor"];
            onionoo [label="Onionoo"];
            subgraph lib {
                node [shape=box,margin="0.11,0.11",height=0,width=0,fontsize=8];
                lib1 [label="metrics-lib"];
                lib2 [label="metrics-lib"];
                lib3 [label="metrics-lib"];
            }
        }
        subgraph user {
            statistics [label="Tor Metrics Graphs"];
            exonerator [label="Exonerator"];
            rs [label="Relay Search"];
            bot [label="metrics-bot"];
        }
    }
    relays -> dirauths;
    bridges -> bridgeauth;
    dirauths -> collector;
    bridgeauth -> collector;
    webservers -> collector;
    collector -> lib1;
    lib1 -> statistics;
    collector -> lib2;
    lib2 -> onionoo;
    collector -> lib3;
    lib3 -> exonerator;
    onionoo -> rs;
    onionoo -> bot;
    onionperf->collector;
}
