%!PS-Adobe-2.0
%%Title: ../graphs/extend-fail.eps
%%Creator: gnuplot 4.6 patchlevel 3
%%CreationDate: Wed Oct  2 20:42:22 2013
%%DocumentFonts: (atend)
%%BoundingBox: 50 50 554 410
%%Orientation: Portrait
%%Pages: (atend)
%%EndComments
%%BeginProlog
/gnudict 256 dict def
gnudict begin
%
% The following true/false flags may be edited by hand if desired.
% The unit line width and grayscale image gamma correction may also be changed.
%
/Color true def
/Blacktext false def
/Solid false def
/Dashlength 1 def
/Landscape false def
/Level1 false def
/Rounded false def
/ClipToBoundingBox false def
/SuppressPDFMark false def
/TransparentPatterns false def
/gnulinewidth 5.000 def
/userlinewidth gnulinewidth def
/Gamma 1.0 def
/BackgroundColor {-1.000 -1.000 -1.000} def
%
/vshift -60 def
/dl1 {
  10.0 Dashlength mul mul
  Rounded { currentlinewidth 0.75 mul sub dup 0 le { pop 0.01 } if } if
} def
/dl2 {
  10.0 Dashlength mul mul
  Rounded { currentlinewidth 0.75 mul add } if
} def
/hpt_ 31.5 def
/vpt_ 31.5 def
/hpt hpt_ def
/vpt vpt_ def
/doclip {
  ClipToBoundingBox {
    newpath 50 50 moveto 554 50 lineto 554 410 lineto 50 410 lineto closepath
    clip
  } if
} def
%
% Gnuplot Prolog Version 4.6 (September 2012)
%
%/SuppressPDFMark true def
%
/M {moveto} bind def
/L {lineto} bind def
/R {rmoveto} bind def
/V {rlineto} bind def
/N {newpath moveto} bind def
/Z {closepath} bind def
/C {setrgbcolor} bind def
/f {rlineto fill} bind def
/g {setgray} bind def
/Gshow {show} def   % May be redefined later in the file to support UTF-8
/vpt2 vpt 2 mul def
/hpt2 hpt 2 mul def
/Lshow {currentpoint stroke M 0 vshift R 
	Blacktext {gsave 0 setgray show grestore} {show} ifelse} def
/Rshow {currentpoint stroke M dup stringwidth pop neg vshift R
	Blacktext {gsave 0 setgray show grestore} {show} ifelse} def
/Cshow {currentpoint stroke M dup stringwidth pop -2 div vshift R 
	Blacktext {gsave 0 setgray show grestore} {show} ifelse} def
/UP {dup vpt_ mul /vpt exch def hpt_ mul /hpt exch def
  /hpt2 hpt 2 mul def /vpt2 vpt 2 mul def} def
/DL {Color {setrgbcolor Solid {pop []} if 0 setdash}
 {pop pop pop 0 setgray Solid {pop []} if 0 setdash} ifelse} def
/BL {stroke userlinewidth 2 mul setlinewidth
	Rounded {1 setlinejoin 1 setlinecap} if} def
/AL {stroke userlinewidth 2 div setlinewidth
	Rounded {1 setlinejoin 1 setlinecap} if} def
/UL {dup gnulinewidth mul /userlinewidth exch def
	dup 1 lt {pop 1} if 10 mul /udl exch def} def
/PL {stroke userlinewidth setlinewidth
	Rounded {1 setlinejoin 1 setlinecap} if} def
3.8 setmiterlimit
% Default Line colors
/LCw {1 1 1} def
/LCb {0 0 0} def
/LCa {0 0 0} def
/LC0 {1 0 0} def
/LC1 {0 1 0} def
/LC2 {0 0 1} def
/LC3 {1 0 1} def
/LC4 {0 1 1} def
/LC5 {1 1 0} def
/LC6 {0 0 0} def
/LC7 {1 0.3 0} def
/LC8 {0.5 0.5 0.5} def
% Default Line Types
/LTw {PL [] 1 setgray} def
/LTb {BL [] LCb DL} def
/LTa {AL [1 udl mul 2 udl mul] 0 setdash LCa setrgbcolor} def
/LT0 {PL [] LC0 DL} def
/LT1 {PL [4 dl1 2 dl2] LC1 DL} def
/LT2 {PL [2 dl1 3 dl2] LC2 DL} def
/LT3 {PL [1 dl1 1.5 dl2] LC3 DL} def
/LT4 {PL [6 dl1 2 dl2 1 dl1 2 dl2] LC4 DL} def
/LT5 {PL [3 dl1 3 dl2 1 dl1 3 dl2] LC5 DL} def
/LT6 {PL [2 dl1 2 dl2 2 dl1 6 dl2] LC6 DL} def
/LT7 {PL [1 dl1 2 dl2 6 dl1 2 dl2 1 dl1 2 dl2] LC7 DL} def
/LT8 {PL [2 dl1 2 dl2 2 dl1 2 dl2 2 dl1 2 dl2 2 dl1 4 dl2] LC8 DL} def
/Pnt {stroke [] 0 setdash gsave 1 setlinecap M 0 0 V stroke grestore} def
/Dia {stroke [] 0 setdash 2 copy vpt add M
  hpt neg vpt neg V hpt vpt neg V
  hpt vpt V hpt neg vpt V closepath stroke
  Pnt} def
/Pls {stroke [] 0 setdash vpt sub M 0 vpt2 V
  currentpoint stroke M
  hpt neg vpt neg R hpt2 0 V stroke
 } def
/Box {stroke [] 0 setdash 2 copy exch hpt sub exch vpt add M
  0 vpt2 neg V hpt2 0 V 0 vpt2 V
  hpt2 neg 0 V closepath stroke
  Pnt} def
/Crs {stroke [] 0 setdash exch hpt sub exch vpt add M
  hpt2 vpt2 neg V currentpoint stroke M
  hpt2 neg 0 R hpt2 vpt2 V stroke} def
/TriU {stroke [] 0 setdash 2 copy vpt 1.12 mul add M
  hpt neg vpt -1.62 mul V
  hpt 2 mul 0 V
  hpt neg vpt 1.62 mul V closepath stroke
  Pnt} def
/Star {2 copy Pls Crs} def
/BoxF {stroke [] 0 setdash exch hpt sub exch vpt add M
  0 vpt2 neg V hpt2 0 V 0 vpt2 V
  hpt2 neg 0 V closepath fill} def
/TriUF {stroke [] 0 setdash vpt 1.12 mul add M
  hpt neg vpt -1.62 mul V
  hpt 2 mul 0 V
  hpt neg vpt 1.62 mul V closepath fill} def
/TriD {stroke [] 0 setdash 2 copy vpt 1.12 mul sub M
  hpt neg vpt 1.62 mul V
  hpt 2 mul 0 V
  hpt neg vpt -1.62 mul V closepath stroke
  Pnt} def
/TriDF {stroke [] 0 setdash vpt 1.12 mul sub M
  hpt neg vpt 1.62 mul V
  hpt 2 mul 0 V
  hpt neg vpt -1.62 mul V closepath fill} def
/DiaF {stroke [] 0 setdash vpt add M
  hpt neg vpt neg V hpt vpt neg V
  hpt vpt V hpt neg vpt V closepath fill} def
/Pent {stroke [] 0 setdash 2 copy gsave
  translate 0 hpt M 4 {72 rotate 0 hpt L} repeat
  closepath stroke grestore Pnt} def
/PentF {stroke [] 0 setdash gsave
  translate 0 hpt M 4 {72 rotate 0 hpt L} repeat
  closepath fill grestore} def
/Circle {stroke [] 0 setdash 2 copy
  hpt 0 360 arc stroke Pnt} def
/CircleF {stroke [] 0 setdash hpt 0 360 arc fill} def
/C0 {BL [] 0 setdash 2 copy moveto vpt 90 450 arc} bind def
/C1 {BL [] 0 setdash 2 copy moveto
	2 copy vpt 0 90 arc closepath fill
	vpt 0 360 arc closepath} bind def
/C2 {BL [] 0 setdash 2 copy moveto
	2 copy vpt 90 180 arc closepath fill
	vpt 0 360 arc closepath} bind def
/C3 {BL [] 0 setdash 2 copy moveto
	2 copy vpt 0 180 arc closepath fill
	vpt 0 360 arc closepath} bind def
/C4 {BL [] 0 setdash 2 copy moveto
	2 copy vpt 180 270 arc closepath fill
	vpt 0 360 arc closepath} bind def
/C5 {BL [] 0 setdash 2 copy moveto
	2 copy vpt 0 90 arc
	2 copy moveto
	2 copy vpt 180 270 arc closepath fill
	vpt 0 360 arc} bind def
/C6 {BL [] 0 setdash 2 copy moveto
	2 copy vpt 90 270 arc closepath fill
	vpt 0 360 arc closepath} bind def
/C7 {BL [] 0 setdash 2 copy moveto
	2 copy vpt 0 270 arc closepath fill
	vpt 0 360 arc closepath} bind def
/C8 {BL [] 0 setdash 2 copy moveto
	2 copy vpt 270 360 arc closepath fill
	vpt 0 360 arc closepath} bind def
/C9 {BL [] 0 setdash 2 copy moveto
	2 copy vpt 270 450 arc closepath fill
	vpt 0 360 arc closepath} bind def
/C10 {BL [] 0 setdash 2 copy 2 copy moveto vpt 270 360 arc closepath fill
	2 copy moveto
	2 copy vpt 90 180 arc closepath fill
	vpt 0 360 arc closepath} bind def
/C11 {BL [] 0 setdash 2 copy moveto
	2 copy vpt 0 180 arc closepath fill
	2 copy moveto
	2 copy vpt 270 360 arc closepath fill
	vpt 0 360 arc closepath} bind def
/C12 {BL [] 0 setdash 2 copy moveto
	2 copy vpt 180 360 arc closepath fill
	vpt 0 360 arc closepath} bind def
/C13 {BL [] 0 setdash 2 copy moveto
	2 copy vpt 0 90 arc closepath fill
	2 copy moveto
	2 copy vpt 180 360 arc closepath fill
	vpt 0 360 arc closepath} bind def
/C14 {BL [] 0 setdash 2 copy moveto
	2 copy vpt 90 360 arc closepath fill
	vpt 0 360 arc} bind def
/C15 {BL [] 0 setdash 2 copy vpt 0 360 arc closepath fill
	vpt 0 360 arc closepath} bind def
/Rec {newpath 4 2 roll moveto 1 index 0 rlineto 0 exch rlineto
	neg 0 rlineto closepath} bind def
/Square {dup Rec} bind def
/Bsquare {vpt sub exch vpt sub exch vpt2 Square} bind def
/S0 {BL [] 0 setdash 2 copy moveto 0 vpt rlineto BL Bsquare} bind def
/S1 {BL [] 0 setdash 2 copy vpt Square fill Bsquare} bind def
/S2 {BL [] 0 setdash 2 copy exch vpt sub exch vpt Square fill Bsquare} bind def
/S3 {BL [] 0 setdash 2 copy exch vpt sub exch vpt2 vpt Rec fill Bsquare} bind def
/S4 {BL [] 0 setdash 2 copy exch vpt sub exch vpt sub vpt Square fill Bsquare} bind def
/S5 {BL [] 0 setdash 2 copy 2 copy vpt Square fill
	exch vpt sub exch vpt sub vpt Square fill Bsquare} bind def
/S6 {BL [] 0 setdash 2 copy exch vpt sub exch vpt sub vpt vpt2 Rec fill Bsquare} bind def
/S7 {BL [] 0 setdash 2 copy exch vpt sub exch vpt sub vpt vpt2 Rec fill
	2 copy vpt Square fill Bsquare} bind def
/S8 {BL [] 0 setdash 2 copy vpt sub vpt Square fill Bsquare} bind def
/S9 {BL [] 0 setdash 2 copy vpt sub vpt vpt2 Rec fill Bsquare} bind def
/S10 {BL [] 0 setdash 2 copy vpt sub vpt Square fill 2 copy exch vpt sub exch vpt Square fill
	Bsquare} bind def
/S11 {BL [] 0 setdash 2 copy vpt sub vpt Square fill 2 copy exch vpt sub exch vpt2 vpt Rec fill
	Bsquare} bind def
/S12 {BL [] 0 setdash 2 copy exch vpt sub exch vpt sub vpt2 vpt Rec fill Bsquare} bind def
/S13 {BL [] 0 setdash 2 copy exch vpt sub exch vpt sub vpt2 vpt Rec fill
	2 copy vpt Square fill Bsquare} bind def
/S14 {BL [] 0 setdash 2 copy exch vpt sub exch vpt sub vpt2 vpt Rec fill
	2 copy exch vpt sub exch vpt Square fill Bsquare} bind def
/S15 {BL [] 0 setdash 2 copy Bsquare fill Bsquare} bind def
/D0 {gsave translate 45 rotate 0 0 S0 stroke grestore} bind def
/D1 {gsave translate 45 rotate 0 0 S1 stroke grestore} bind def
/D2 {gsave translate 45 rotate 0 0 S2 stroke grestore} bind def
/D3 {gsave translate 45 rotate 0 0 S3 stroke grestore} bind def
/D4 {gsave translate 45 rotate 0 0 S4 stroke grestore} bind def
/D5 {gsave translate 45 rotate 0 0 S5 stroke grestore} bind def
/D6 {gsave translate 45 rotate 0 0 S6 stroke grestore} bind def
/D7 {gsave translate 45 rotate 0 0 S7 stroke grestore} bind def
/D8 {gsave translate 45 rotate 0 0 S8 stroke grestore} bind def
/D9 {gsave translate 45 rotate 0 0 S9 stroke grestore} bind def
/D10 {gsave translate 45 rotate 0 0 S10 stroke grestore} bind def
/D11 {gsave translate 45 rotate 0 0 S11 stroke grestore} bind def
/D12 {gsave translate 45 rotate 0 0 S12 stroke grestore} bind def
/D13 {gsave translate 45 rotate 0 0 S13 stroke grestore} bind def
/D14 {gsave translate 45 rotate 0 0 S14 stroke grestore} bind def
/D15 {gsave translate 45 rotate 0 0 S15 stroke grestore} bind def
/DiaE {stroke [] 0 setdash vpt add M
  hpt neg vpt neg V hpt vpt neg V
  hpt vpt V hpt neg vpt V closepath stroke} def
/BoxE {stroke [] 0 setdash exch hpt sub exch vpt add M
  0 vpt2 neg V hpt2 0 V 0 vpt2 V
  hpt2 neg 0 V closepath stroke} def
/TriUE {stroke [] 0 setdash vpt 1.12 mul add M
  hpt neg vpt -1.62 mul V
  hpt 2 mul 0 V
  hpt neg vpt 1.62 mul V closepath stroke} def
/TriDE {stroke [] 0 setdash vpt 1.12 mul sub M
  hpt neg vpt 1.62 mul V
  hpt 2 mul 0 V
  hpt neg vpt -1.62 mul V closepath stroke} def
/PentE {stroke [] 0 setdash gsave
  translate 0 hpt M 4 {72 rotate 0 hpt L} repeat
  closepath stroke grestore} def
/CircE {stroke [] 0 setdash 
  hpt 0 360 arc stroke} def
/Opaque {gsave closepath 1 setgray fill grestore 0 setgray closepath} def
/DiaW {stroke [] 0 setdash vpt add M
  hpt neg vpt neg V hpt vpt neg V
  hpt vpt V hpt neg vpt V Opaque stroke} def
/BoxW {stroke [] 0 setdash exch hpt sub exch vpt add M
  0 vpt2 neg V hpt2 0 V 0 vpt2 V
  hpt2 neg 0 V Opaque stroke} def
/TriUW {stroke [] 0 setdash vpt 1.12 mul add M
  hpt neg vpt -1.62 mul V
  hpt 2 mul 0 V
  hpt neg vpt 1.62 mul V Opaque stroke} def
/TriDW {stroke [] 0 setdash vpt 1.12 mul sub M
  hpt neg vpt 1.62 mul V
  hpt 2 mul 0 V
  hpt neg vpt -1.62 mul V Opaque stroke} def
/PentW {stroke [] 0 setdash gsave
  translate 0 hpt M 4 {72 rotate 0 hpt L} repeat
  Opaque stroke grestore} def
/CircW {stroke [] 0 setdash 
  hpt 0 360 arc Opaque stroke} def
/BoxFill {gsave Rec 1 setgray fill grestore} def
/Density {
  /Fillden exch def
  currentrgbcolor
  /ColB exch def /ColG exch def /ColR exch def
  /ColR ColR Fillden mul Fillden sub 1 add def
  /ColG ColG Fillden mul Fillden sub 1 add def
  /ColB ColB Fillden mul Fillden sub 1 add def
  ColR ColG ColB setrgbcolor} def
/BoxColFill {gsave Rec PolyFill} def
/PolyFill {gsave Density fill grestore grestore} def
/h {rlineto rlineto rlineto gsave closepath fill grestore} bind def
%
% PostScript Level 1 Pattern Fill routine for rectangles
% Usage: x y w h s a XX PatternFill
%	x,y = lower left corner of box to be filled
%	w,h = width and height of box
%	  a = angle in degrees between lines and x-axis
%	 XX = 0/1 for no/yes cross-hatch
%
/PatternFill {gsave /PFa [ 9 2 roll ] def
  PFa 0 get PFa 2 get 2 div add PFa 1 get PFa 3 get 2 div add translate
  PFa 2 get -2 div PFa 3 get -2 div PFa 2 get PFa 3 get Rec
  TransparentPatterns {} {gsave 1 setgray fill grestore} ifelse
  clip
  currentlinewidth 0.5 mul setlinewidth
  /PFs PFa 2 get dup mul PFa 3 get dup mul add sqrt def
  0 0 M PFa 5 get rotate PFs -2 div dup translate
  0 1 PFs PFa 4 get div 1 add floor cvi
	{PFa 4 get mul 0 M 0 PFs V} for
  0 PFa 6 get ne {
	0 1 PFs PFa 4 get div 1 add floor cvi
	{PFa 4 get mul 0 2 1 roll M PFs 0 V} for
 } if
  stroke grestore} def
%
/languagelevel where
 {pop languagelevel} {1} ifelse
 2 lt
	{/InterpretLevel1 true def}
	{/InterpretLevel1 Level1 def}
 ifelse
%
% PostScript level 2 pattern fill definitions
%
/Level2PatternFill {
/Tile8x8 {/PaintType 2 /PatternType 1 /TilingType 1 /BBox [0 0 8 8] /XStep 8 /YStep 8}
	bind def
/KeepColor {currentrgbcolor [/Pattern /DeviceRGB] setcolorspace} bind def
<< Tile8x8
 /PaintProc {0.5 setlinewidth pop 0 0 M 8 8 L 0 8 M 8 0 L stroke} 
>> matrix makepattern
/Pat1 exch def
<< Tile8x8
 /PaintProc {0.5 setlinewidth pop 0 0 M 8 8 L 0 8 M 8 0 L stroke
	0 4 M 4 8 L 8 4 L 4 0 L 0 4 L stroke}
>> matrix makepattern
/Pat2 exch def
<< Tile8x8
 /PaintProc {0.5 setlinewidth pop 0 0 M 0 8 L
	8 8 L 8 0 L 0 0 L fill}
>> matrix makepattern
/Pat3 exch def
<< Tile8x8
 /PaintProc {0.5 setlinewidth pop -4 8 M 8 -4 L
	0 12 M 12 0 L stroke}
>> matrix makepattern
/Pat4 exch def
<< Tile8x8
 /PaintProc {0.5 setlinewidth pop -4 0 M 8 12 L
	0 -4 M 12 8 L stroke}
>> matrix makepattern
/Pat5 exch def
<< Tile8x8
 /PaintProc {0.5 setlinewidth pop -2 8 M 4 -4 L
	0 12 M 8 -4 L 4 12 M 10 0 L stroke}
>> matrix makepattern
/Pat6 exch def
<< Tile8x8
 /PaintProc {0.5 setlinewidth pop -2 0 M 4 12 L
	0 -4 M 8 12 L 4 -4 M 10 8 L stroke}
>> matrix makepattern
/Pat7 exch def
<< Tile8x8
 /PaintProc {0.5 setlinewidth pop 8 -2 M -4 4 L
	12 0 M -4 8 L 12 4 M 0 10 L stroke}
>> matrix makepattern
/Pat8 exch def
<< Tile8x8
 /PaintProc {0.5 setlinewidth pop 0 -2 M 12 4 L
	-4 0 M 12 8 L -4 4 M 8 10 L stroke}
>> matrix makepattern
/Pat9 exch def
/Pattern1 {PatternBgnd KeepColor Pat1 setpattern} bind def
/Pattern2 {PatternBgnd KeepColor Pat2 setpattern} bind def
/Pattern3 {PatternBgnd KeepColor Pat3 setpattern} bind def
/Pattern4 {PatternBgnd KeepColor Landscape {Pat5} {Pat4} ifelse setpattern} bind def
/Pattern5 {PatternBgnd KeepColor Landscape {Pat4} {Pat5} ifelse setpattern} bind def
/Pattern6 {PatternBgnd KeepColor Landscape {Pat9} {Pat6} ifelse setpattern} bind def
/Pattern7 {PatternBgnd KeepColor Landscape {Pat8} {Pat7} ifelse setpattern} bind def
} def
%
%
%End of PostScript Level 2 code
%
/PatternBgnd {
  TransparentPatterns {} {gsave 1 setgray fill grestore} ifelse
} def
%
% Substitute for Level 2 pattern fill codes with
% grayscale if Level 2 support is not selected.
%
/Level1PatternFill {
/Pattern1 {0.250 Density} bind def
/Pattern2 {0.500 Density} bind def
/Pattern3 {0.750 Density} bind def
/Pattern4 {0.125 Density} bind def
/Pattern5 {0.375 Density} bind def
/Pattern6 {0.625 Density} bind def
/Pattern7 {0.875 Density} bind def
} def
%
% Now test for support of Level 2 code
%
Level1 {Level1PatternFill} {Level2PatternFill} ifelse
%
/Symbol-Oblique /Symbol findfont [1 0 .167 1 0 0] makefont
dup length dict begin {1 index /FID eq {pop pop} {def} ifelse} forall
currentdict end definefont pop
/MFshow {
   { dup 5 get 3 ge
     { 5 get 3 eq {gsave} {grestore} ifelse }
     {dup dup 0 get findfont exch 1 get scalefont setfont
     [ currentpoint ] exch dup 2 get 0 exch R dup 5 get 2 ne {dup dup 6
     get exch 4 get {Gshow} {stringwidth pop 0 R} ifelse }if dup 5 get 0 eq
     {dup 3 get {2 get neg 0 exch R pop} {pop aload pop M} ifelse} {dup 5
     get 1 eq {dup 2 get exch dup 3 get exch 6 get stringwidth pop -2 div
     dup 0 R} {dup 6 get stringwidth pop -2 div 0 R 6 get
     show 2 index {aload pop M neg 3 -1 roll neg R pop pop} {pop pop pop
     pop aload pop M} ifelse }ifelse }ifelse }
     ifelse }
   forall} def
/Gswidth {dup type /stringtype eq {stringwidth} {pop (n) stringwidth} ifelse} def
/MFwidth {0 exch { dup 5 get 3 ge { 5 get 3 eq { 0 } { pop } ifelse }
 {dup 3 get{dup dup 0 get findfont exch 1 get scalefont setfont
     6 get Gswidth pop add} {pop} ifelse} ifelse} forall} def
/MLshow { currentpoint stroke M
  0 exch R
  Blacktext {gsave 0 setgray MFshow grestore} {MFshow} ifelse } bind def
/MRshow { currentpoint stroke M
  exch dup MFwidth neg 3 -1 roll R
  Blacktext {gsave 0 setgray MFshow grestore} {MFshow} ifelse } bind def
/MCshow { currentpoint stroke M
  exch dup MFwidth -2 div 3 -1 roll R
  Blacktext {gsave 0 setgray MFshow grestore} {MFshow} ifelse } bind def
/XYsave    { [( ) 1 2 true false 3 ()] } bind def
/XYrestore { [( ) 1 2 true false 4 ()] } bind def
Level1 SuppressPDFMark or 
{} {
/SDict 10 dict def
systemdict /pdfmark known not {
  userdict /pdfmark systemdict /cleartomark get put
} if
SDict begin [
  /Title (../graphs/extend-fail.eps)
  /Subject (gnuplot plot)
  /Creator (gnuplot 4.6 patchlevel 3)
  /Author (hopper)
%  /Producer (gnuplot)
%  /Keywords ()
  /CreationDate (Wed Oct  2 20:42:22 2013)
  /DOCINFO pdfmark
end
} ifelse
end
%%EndProlog
%%Page: 1 1
gnudict begin
gsave
doclip
50 50 translate
0.100 0.100 scale
0 setgray
newpath
(Helvetica) findfont 180 scalefont setfont
BackgroundColor 0 lt 3 1 roll 0 lt exch 0 lt or or not {gsave BackgroundColor C clippath fill grestore} if
1.000 UL
LTb
LCb setrgbcolor
4.000 UL
LTa
LCa setrgbcolor
990 576 M
3725 0 V
stroke
1.000 UL
LTb
LCb setrgbcolor
990 576 M
63 0 V
3662 0 R
-63 0 V
stroke
882 576 M
[ [(Helvetica) 180.0 0.0 true true 0 ( 0)]
] -60.0 MRshow
1.000 UL
LTb
LCb setrgbcolor
4.000 UL
LTa
LCa setrgbcolor
990 927 M
3725 0 V
stroke
1.000 UL
LTb
LCb setrgbcolor
990 927 M
63 0 V
3662 0 R
-63 0 V
stroke
882 927 M
[ [(Helvetica) 180.0 0.0 true true 0 ( 0.05)]
] -60.0 MRshow
1.000 UL
LTb
LCb setrgbcolor
4.000 UL
LTa
LCa setrgbcolor
990 1278 M
3725 0 V
stroke
1.000 UL
LTb
LCb setrgbcolor
990 1278 M
63 0 V
3662 0 R
-63 0 V
stroke
882 1278 M
[ [(Helvetica) 180.0 0.0 true true 0 ( 0.1)]
] -60.0 MRshow
1.000 UL
LTb
LCb setrgbcolor
4.000 UL
LTa
LCa setrgbcolor
990 1629 M
3725 0 V
stroke
1.000 UL
LTb
LCb setrgbcolor
990 1629 M
63 0 V
3662 0 R
-63 0 V
stroke
882 1629 M
[ [(Helvetica) 180.0 0.0 true true 0 ( 0.15)]
] -60.0 MRshow
1.000 UL
LTb
LCb setrgbcolor
4.000 UL
LTa
LCa setrgbcolor
990 1980 M
3725 0 V
stroke
1.000 UL
LTb
LCb setrgbcolor
990 1980 M
63 0 V
3662 0 R
-63 0 V
stroke
882 1980 M
[ [(Helvetica) 180.0 0.0 true true 0 ( 0.2)]
] -60.0 MRshow
1.000 UL
LTb
LCb setrgbcolor
4.000 UL
LTa
LCa setrgbcolor
990 2331 M
3725 0 V
stroke
1.000 UL
LTb
LCb setrgbcolor
990 2331 M
63 0 V
3662 0 R
-63 0 V
stroke
882 2331 M
[ [(Helvetica) 180.0 0.0 true true 0 ( 0.25)]
] -60.0 MRshow
1.000 UL
LTb
LCb setrgbcolor
4.000 UL
LTa
LCa setrgbcolor
990 2682 M
3725 0 V
stroke
1.000 UL
LTb
LCb setrgbcolor
990 2682 M
63 0 V
3662 0 R
-63 0 V
stroke
882 2682 M
[ [(Helvetica) 180.0 0.0 true true 0 ( 0.3)]
] -60.0 MRshow
1.000 UL
LTb
LCb setrgbcolor
4.000 UL
LTa
LCa setrgbcolor
990 3033 M
1718 0 V
1899 0 R
108 0 V
stroke
1.000 UL
LTb
LCb setrgbcolor
990 3033 M
63 0 V
3662 0 R
-63 0 V
stroke
882 3033 M
[ [(Helvetica) 180.0 0.0 true true 0 ( 0.35)]
] -60.0 MRshow
1.000 UL
LTb
LCb setrgbcolor
4.000 UL
LTa
LCa setrgbcolor
990 3384 M
3725 0 V
stroke
1.000 UL
LTb
LCb setrgbcolor
990 3384 M
63 0 V
3662 0 R
-63 0 V
stroke
882 3384 M
[ [(Helvetica) 180.0 0.0 true true 0 ( 0.4)]
] -60.0 MRshow
1.000 UL
LTb
LCb setrgbcolor
4.000 UL
LTa
LCa setrgbcolor
990 576 M
0 2808 V
stroke
1.000 UL
LTb
LCb setrgbcolor
990 576 M
0 63 V
0 2745 R
0 -63 V
stroke
990 396 M
[ [(Helvetica) 180.0 0.0 true true 0 ( 0)]
] -60.0 MCshow
1.000 UL
LTb
LCb setrgbcolor
4.000 UL
LTa
LCa setrgbcolor
1329 576 M
0 2808 V
stroke
1.000 UL
LTb
LCb setrgbcolor
1329 576 M
0 63 V
0 2745 R
0 -63 V
stroke
1329 396 M
[ [(Helvetica) 180.0 0.0 true true 0 ( 12)]
] -60.0 MCshow
1.000 UL
LTb
LCb setrgbcolor
4.000 UL
LTa
LCa setrgbcolor
1667 576 M
0 2808 V
stroke
1.000 UL
LTb
LCb setrgbcolor
1667 576 M
0 63 V
0 2745 R
0 -63 V
stroke
1667 396 M
[ [(Helvetica) 180.0 0.0 true true 0 ( 24)]
] -60.0 MCshow
1.000 UL
LTb
LCb setrgbcolor
4.000 UL
LTa
LCa setrgbcolor
2006 576 M
0 2808 V
stroke
1.000 UL
LTb
LCb setrgbcolor
2006 576 M
0 63 V
0 2745 R
0 -63 V
stroke
2006 396 M
[ [(Helvetica) 180.0 0.0 true true 0 ( 36)]
] -60.0 MCshow
1.000 UL
LTb
LCb setrgbcolor
4.000 UL
LTa
LCa setrgbcolor
2345 576 M
0 2808 V
stroke
1.000 UL
LTb
LCb setrgbcolor
2345 576 M
0 63 V
0 2745 R
0 -63 V
stroke
2345 396 M
[ [(Helvetica) 180.0 0.0 true true 0 ( 48)]
] -60.0 MCshow
1.000 UL
LTb
LCb setrgbcolor
4.000 UL
LTa
LCa setrgbcolor
2683 576 M
0 2808 V
stroke
1.000 UL
LTb
LCb setrgbcolor
2683 576 M
0 63 V
0 2745 R
0 -63 V
stroke
2683 396 M
[ [(Helvetica) 180.0 0.0 true true 0 ( 60)]
] -60.0 MCshow
1.000 UL
LTb
LCb setrgbcolor
4.000 UL
LTa
LCa setrgbcolor
3022 576 M
0 2385 V
0 360 R
0 63 V
stroke
1.000 UL
LTb
LCb setrgbcolor
3022 576 M
0 63 V
0 2745 R
0 -63 V
stroke
3022 396 M
[ [(Helvetica) 180.0 0.0 true true 0 ( 72)]
] -60.0 MCshow
1.000 UL
LTb
LCb setrgbcolor
4.000 UL
LTa
LCa setrgbcolor
3360 576 M
0 2385 V
0 360 R
0 63 V
stroke
1.000 UL
LTb
LCb setrgbcolor
3360 576 M
0 63 V
0 2745 R
0 -63 V
stroke
3360 396 M
[ [(Helvetica) 180.0 0.0 true true 0 ( 84)]
] -60.0 MCshow
1.000 UL
LTb
LCb setrgbcolor
4.000 UL
LTa
LCa setrgbcolor
3699 576 M
0 2385 V
0 360 R
0 63 V
stroke
1.000 UL
LTb
LCb setrgbcolor
3699 576 M
0 63 V
0 2745 R
0 -63 V
stroke
3699 396 M
[ [(Helvetica) 180.0 0.0 true true 0 ( 96)]
] -60.0 MCshow
1.000 UL
LTb
LCb setrgbcolor
4.000 UL
LTa
LCa setrgbcolor
4038 576 M
0 2385 V
0 360 R
0 63 V
stroke
1.000 UL
LTb
LCb setrgbcolor
4038 576 M
0 63 V
0 2745 R
0 -63 V
stroke
4038 396 M
[ [(Helvetica) 180.0 0.0 true true 0 ( 108)]
] -60.0 MCshow
1.000 UL
LTb
LCb setrgbcolor
4.000 UL
LTa
LCa setrgbcolor
4376 576 M
0 2385 V
0 360 R
0 63 V
stroke
1.000 UL
LTb
LCb setrgbcolor
4376 576 M
0 63 V
0 2745 R
0 -63 V
stroke
4376 396 M
[ [(Helvetica) 180.0 0.0 true true 0 ( 120)]
] -60.0 MCshow
1.000 UL
LTb
LCb setrgbcolor
4.000 UL
LTa
LCa setrgbcolor
4715 576 M
0 2808 V
stroke
1.000 UL
LTb
LCb setrgbcolor
4715 576 M
0 63 V
0 2745 R
0 -63 V
stroke
4715 396 M
[ [(Helvetica) 180.0 0.0 true true 0 ( 132)]
] -60.0 MCshow
1.000 UL
LTb
LCb setrgbcolor
1.000 UL
LTb
LCb setrgbcolor
990 3384 N
990 576 L
3725 0 V
0 2808 V
-3725 0 V
Z stroke
LCb setrgbcolor
144 1980 M
currentpoint gsave translate -270 rotate 0 0 moveto
[ [(Helvetica) 180.0 0.0 true true 0 (onionskin fail rate)]
] -60.0 MCshow
grestore
LTb
LCb setrgbcolor
2852 126 M
[ [(Helvetica) 180.0 0.0 true true 0 (hour)]
] -60.0 MCshow
LTb
1.000 UP
1.000 UL
LTb
LCb setrgbcolor
% Begin plot #1
1.000 UP
4.000 UL
LT0
0.00 0.00 0.80 C LCb setrgbcolor
3896 3231 M
[ [(Helvetica) 180.0 0.0 true true 0 (0.2.4.17-rc)]
] -60.0 MRshow
LT0
0.00 0.00 0.80 C 4004 3231 M
495 0 V
-495 31 R
0 -62 V
495 62 R
0 -62 V
990 1329 M
28 73 V
28 -230 V
29 -25 V
28 108 V
28 -268 V
28 190 V
29 -241 V
28 -111 V
28 79 V
28 -20 V
28 161 V
29 -28 V
28 189 V
28 -134 V
28 376 V
29 149 V
28 27 V
28 -48 V
28 -254 V
28 -3 V
29 63 V
28 -9 V
28 43 V
28 -240 V
28 171 V
29 7 V
28 -271 V
28 -117 V
28 -119 V
29 -14 V
28 60 V
28 41 V
28 -65 V
28 58 V
29 118 V
28 -23 V
28 141 V
28 92 V
29 15 V
28 95 V
28 -95 V
28 245 V
85 70 R
28 -182 V
28 164 V
29 -39 V
28 -131 V
28 -231 V
28 -106 V
28 -107 V
29 -105 V
28 73 V
28 90 V
28 5 V
29 -126 V
28 287 V
28 -197 V
28 105 V
28 -38 V
29 90 V
28 102 V
28 4 V
28 27 V
29 286 V
28 -2 V
28 -90 V
28 10 V
28 159 V
29 -189 V
28 129 V
28 -219 V
28 0 V
28 -221 V
29 40 V
28 -158 V
28 -80 V
28 -166 V
29 75 V
28 319 V
28 -283 V
28 163 V
28 459 V
29 -357 V
28 109 V
28 -172 V
28 84 V
29 362 V
28 -140 V
28 395 V
28 -40 V
28 -212 V
29 -25 V
28 -118 V
28 418 V
28 -559 V
29 -103 V
28 -170 V
28 121 V
stroke 3812 1095 M
28 -218 V
28 81 V
29 -49 V
28 87 V
28 -17 V
28 -190 V
29 294 V
28 25 V
28 168 V
28 -12 V
28 -64 V
29 16 V
28 209 V
28 96 V
28 -75 V
28 -58 V
29 246 V
28 -242 V
28 -68 V
28 150 V
29 -134 V
28 -179 V
28 -97 V
28 -125 V
28 24 V
29 12 V
990 1114 M
0 456 V
959 1114 M
62 0 V
-62 456 R
62 0 V
-3 -400 R
0 490 V
987 1170 M
62 0 V
-62 490 R
62 0 V
-3 -671 R
0 392 V
1015 989 M
62 0 V
-62 392 R
62 0 V
-2 -421 R
0 403 V
1044 960 M
62 0 V
-62 403 R
62 0 V
-3 -316 R
0 444 V
-31 -444 R
62 0 V
-62 444 R
62 0 V
-3 -662 R
0 347 V
1100 829 M
62 0 V
-62 347 R
62 0 V
-3 -193 R
0 415 V
1128 983 M
62 0 V
-62 415 R
62 0 V
-2 -607 R
0 321 V
1157 791 M
62 0 V
-62 321 R
62 0 V
-3 -406 R
0 274 V
1185 706 M
62 0 V
-62 274 R
62 0 V
-3 -215 R
0 312 V
1213 765 M
62 0 V
-62 312 R
62 0 V
-3 -327 R
0 301 V
1241 750 M
62 0 V
-62 301 R
62 0 V
-3 -174 R
0 368 V
1269 877 M
62 0 V
-62 368 R
62 0 V
-2 -390 R
0 355 V
1298 855 M
62 0 V
-62 355 R
62 0 V
stroke 1360 1210 M
-3 -195 R
0 407 V
-31 -407 R
62 0 V
-62 407 R
62 0 V
-3 -522 R
0 372 V
1354 900 M
62 0 V
-62 372 R
62 0 V
-3 -54 R
0 485 V
-31 -485 R
62 0 V
-62 485 R
62 0 V
-2 -362 R
0 536 V
-31 -536 R
62 0 V
-62 536 R
62 0 V
-3 -509 R
0 533 V
-31 -533 R
62 0 V
-62 533 R
62 0 V
-3 -557 R
0 483 V
-31 -483 R
62 0 V
-62 483 R
62 0 V
-3 -718 R
0 452 V
-31 -452 R
62 0 V
-62 452 R
62 0 V
-3 -457 R
0 457 V
-31 -457 R
62 0 V
-62 457 R
62 0 V
-2 -406 R
0 479 V
-31 -479 R
62 0 V
-62 479 R
62 0 V
-3 -477 R
0 457 V
-31 -457 R
62 0 V
-62 457 R
62 0 V
-3 -431 R
0 491 V
-31 -491 R
62 0 V
-62 491 R
62 0 V
-3 -688 R
0 408 V
1636 986 M
62 0 V
-62 408 R
62 0 V
-3 -267 R
0 466 V
-31 -466 R
62 0 V
-62 466 R
62 0 V
-2 -461 R
0 470 V
-31 -470 R
62 0 V
-62 470 R
62 0 V
-3 -688 R
0 365 V
1721 914 M
62 0 V
-62 365 R
62 0 V
-3 -466 R
0 338 V
1749 813 M
62 0 V
-62 338 R
62 0 V
-3 -430 R
0 286 V
1777 721 M
62 0 V
-62 286 R
62 0 V
-2 -293 R
0 271 V
stroke 1837 985 M
1806 714 M
62 0 V
-62 271 R
62 0 V
-3 -226 R
0 301 V
1834 759 M
62 0 V
-62 301 R
62 0 V
-3 -273 R
0 329 V
1862 787 M
62 0 V
-62 329 R
62 0 V
-3 -375 R
0 287 V
1890 741 M
62 0 V
-62 287 R
62 0 V
-3 -246 R
0 323 V
1918 782 M
62 0 V
-62 323 R
62 0 V
-2 -232 R
0 376 V
1947 873 M
62 0 V
-62 376 R
62 0 V
-3 -390 R
0 358 V
1975 859 M
62 0 V
-62 358 R
62 0 V
-3 -243 R
0 406 V
2003 974 M
62 0 V
-62 406 R
62 0 V
-3 -330 R
0 438 V
-31 -438 R
62 0 V
-62 438 R
62 0 V
-2 -428 R
0 447 V
-31 -447 R
62 0 V
-62 447 R
62 0 V
-3 -361 R
0 463 V
-31 -463 R
62 0 V
-62 463 R
62 0 V
-3 -549 R
0 447 V
-31 -447 R
62 0 V
-62 447 R
62 0 V
-3 -232 R
0 502 V
-31 -502 R
62 0 V
-62 502 R
62 0 V
54 -441 R
0 519 V
-31 -519 R
62 0 V
-62 519 R
62 0 V
-3 -671 R
0 461 V
-31 -461 R
62 0 V
-62 461 R
62 0 V
-3 -328 R
0 522 V
-31 -522 R
62 0 V
-62 522 R
62 0 V
-2 -549 R
0 498 V
-31 -498 R
62 0 V
-62 498 R
62 0 V
-3 -606 R
0 454 V
-31 -454 R
62 0 V
stroke 2404 1182 M
-62 454 R
62 0 V
-3 -660 R
0 408 V
2370 976 M
62 0 V
-62 408 R
62 0 V
-3 -494 R
0 371 V
2398 890 M
62 0 V
-62 371 R
62 0 V
-3 -456 R
0 327 V
2426 805 M
62 0 V
-62 327 R
62 0 V
-2 -410 R
0 287 V
2455 722 M
62 0 V
-62 287 R
62 0 V
-3 -230 R
0 317 V
2483 779 M
62 0 V
-62 317 R
62 0 V
-3 -248 R
0 357 V
2511 848 M
62 0 V
-62 357 R
62 0 V
-3 -354 R
0 362 V
2539 851 M
62 0 V
-62 362 R
62 0 V
-2 -460 R
0 308 V
2568 753 M
62 0 V
-62 308 R
62 0 V
-3 -80 R
0 422 V
2596 981 M
62 0 V
-62 422 R
62 0 V
-3 -581 R
0 350 V
2624 822 M
62 0 V
-62 350 R
62 0 V
-3 -263 R
0 381 V
2652 909 M
62 0 V
-62 381 R
62 0 V
-3 -409 R
0 361 V
2680 881 M
62 0 V
-62 361 R
62 0 V
-2 -292 R
0 403 V
2709 950 M
62 0 V
-62 403 R
62 0 V
-3 -320 R
0 442 V
-31 -442 R
62 0 V
-62 442 R
62 0 V
-3 -431 R
0 424 V
-31 -424 R
62 0 V
-62 424 R
62 0 V
-3 -405 R
0 440 V
-31 -440 R
62 0 V
-62 440 R
62 0 V
-2 -189 R
0 506 V
-31 -506 R
62 0 V
-62 506 R
62 0 V
stroke 2884 1820 M
-3 -506 R
0 500 V
-31 -500 R
62 0 V
-62 500 R
62 0 V
-3 -590 R
0 505 V
-31 -505 R
62 0 V
-62 505 R
62 0 V
-3 -492 R
0 499 V
-31 -499 R
62 0 V
-62 499 R
62 0 V
-3 -354 R
0 522 V
-31 -522 R
62 0 V
-62 522 R
62 0 V
-2 -687 R
0 477 V
-31 -477 R
62 0 V
-62 477 R
62 0 V
-3 -370 R
0 520 V
-31 -520 R
62 0 V
-62 520 R
62 0 V
-3 -707 R
0 458 V
-31 -458 R
62 0 V
-62 458 R
62 0 V
-3 -458 R
0 458 V
-31 -458 R
62 0 V
-62 458 R
62 0 V
-3 -644 R
0 393 V
3075 951 M
62 0 V
-62 393 R
62 0 V
-2 -363 R
0 413 V
3104 981 M
62 0 V
-62 413 R
62 0 V
-3 -544 R
0 361 V
3132 850 M
62 0 V
-62 361 R
62 0 V
-3 -420 R
0 320 V
3160 791 M
62 0 V
-62 320 R
62 0 V
-3 -442 R
0 233 V
3188 669 M
62 0 V
-62 233 R
62 0 V
-2 -182 R
0 282 V
3217 720 M
62 0 V
-62 282 R
62 0 V
-3 -28 R
0 406 V
3245 974 M
62 0 V
-62 406 R
62 0 V
-3 -632 R
0 298 V
3273 748 M
62 0 V
-62 298 R
62 0 V
-3 -171 R
0 366 V
3301 875 M
62 0 V
-62 366 R
62 0 V
-3 22 R
0 502 V
stroke 3360 1765 M
-31 -502 R
62 0 V
-62 502 R
62 0 V
-2 -803 R
0 394 V
3358 962 M
62 0 V
-62 394 R
62 0 V
-3 -299 R
0 418 V
-31 -418 R
62 0 V
-62 418 R
62 0 V
-3 -568 R
0 379 V
3414 907 M
62 0 V
-62 379 R
62 0 V
-3 -310 R
0 408 V
3442 976 M
62 0 V
-62 408 R
62 0 V
-2 -94 R
0 498 V
-31 -498 R
62 0 V
-62 498 R
62 0 V
-3 -623 R
0 470 V
-31 -470 R
62 0 V
-62 470 R
62 0 V
-3 -131 R
0 577 V
-31 -577 R
62 0 V
-62 577 R
62 0 V
-3 -604 R
0 550 V
-31 -550 R
62 0 V
-62 550 R
62 0 V
-3 -735 R
0 499 V
-31 -499 R
62 0 V
-62 499 R
62 0 V
-2 -533 R
0 521 V
-31 -521 R
62 0 V
-62 521 R
62 0 V
-3 -616 R
0 476 V
-31 -476 R
62 0 V
-62 476 R
62 0 V
-3 -109 R
0 571 V
-31 -571 R
62 0 V
-62 571 R
62 0 V
-3 -1056 R
0 432 V
-31 -432 R
62 0 V
-62 432 R
62 0 V
-2 -519 R
0 401 V
3725 958 M
62 0 V
-62 401 R
62 0 V
-3 -538 R
0 336 V
3753 821 M
62 0 V
-62 336 R
62 0 V
-3 -238 R
0 380 V
3781 919 M
62 0 V
-62 380 R
62 0 V
-3 -553 R
0 295 V
3809 746 M
62 0 V
stroke 3871 746 M
-62 295 R
62 0 V
-3 -233 R
0 332 V
3837 808 M
62 0 V
-62 332 R
62 0 V
-2 -368 R
0 306 V
3866 772 M
62 0 V
-62 306 R
62 0 V
-3 -239 R
0 345 V
3894 839 M
62 0 V
-62 345 R
62 0 V
-3 -359 R
0 340 V
3922 825 M
62 0 V
-62 340 R
62 0 V
-3 -482 R
0 246 V
3950 683 M
62 0 V
-62 246 R
62 0 V
-2 -21 R
0 380 V
3979 908 M
62 0 V
-62 380 R
62 0 V
-3 -364 R
0 398 V
4007 924 M
62 0 V
-62 398 R
62 0 V
-3 -251 R
0 437 V
-31 -437 R
62 0 V
-62 437 R
62 0 V
-3 -446 R
0 430 V
-31 -430 R
62 0 V
-62 430 R
62 0 V
-3 -487 R
0 416 V
-31 -416 R
62 0 V
-62 416 R
62 0 V
-2 -407 R
0 433 V
-31 -433 R
62 0 V
-62 433 R
62 0 V
-3 -233 R
0 443 V
-31 -443 R
62 0 V
-62 443 R
62 0 V
-3 -383 R
0 517 V
-31 -517 R
62 0 V
-62 517 R
62 0 V
-3 -578 R
0 490 V
-31 -490 R
62 0 V
-62 490 R
62 0 V
-3 -540 R
0 476 V
-31 -476 R
62 0 V
-62 476 R
62 0 V
-2 -265 R
0 543 V
-31 -543 R
62 0 V
-62 543 R
62 0 V
-3 -749 R
0 473 V
-31 -473 R
62 0 V
-62 473 R
62 0 V
stroke 4351 1641 M
-3 -533 R
0 458 V
-31 -458 R
62 0 V
-62 458 R
62 0 V
-3 -329 R
0 499 V
-31 -499 R
62 0 V
-62 499 R
62 0 V
-2 -617 R
0 468 V
-31 -468 R
62 0 V
-62 468 R
62 0 V
-3 -606 R
0 386 V
4402 981 M
62 0 V
-62 386 R
62 0 V
-3 -478 R
0 381 V
4430 889 M
62 0 V
-62 381 R
62 0 V
-3 -477 R
0 324 V
4458 793 M
62 0 V
-62 324 R
62 0 V
-3 -306 R
0 335 V
4486 811 M
62 0 V
-62 335 R
62 0 V
-2 -327 R
0 346 V
4515 819 M
62 0 V
-62 346 R
62 0 V
990 1329 Pls
1018 1402 Pls
1046 1172 Pls
1075 1147 Pls
1103 1255 Pls
1131 987 Pls
1159 1177 Pls
1188 936 Pls
1216 825 Pls
1244 904 Pls
1272 884 Pls
1300 1045 Pls
1329 1017 Pls
1357 1206 Pls
1385 1072 Pls
1413 1448 Pls
1442 1597 Pls
1470 1624 Pls
1498 1576 Pls
1526 1322 Pls
1554 1319 Pls
1583 1382 Pls
1611 1373 Pls
1639 1416 Pls
1667 1176 Pls
1695 1347 Pls
1724 1354 Pls
1752 1083 Pls
1780 966 Pls
1808 847 Pls
1837 833 Pls
1865 893 Pls
1893 934 Pls
1921 869 Pls
1949 927 Pls
1978 1045 Pls
2006 1022 Pls
2034 1163 Pls
2062 1255 Pls
2091 1270 Pls
2119 1365 Pls
2147 1270 Pls
2175 1515 Pls
2260 1585 Pls
2288 1403 Pls
2316 1567 Pls
2345 1528 Pls
2373 1397 Pls
2401 1166 Pls
2429 1060 Pls
2457 953 Pls
2486 848 Pls
2514 921 Pls
2542 1011 Pls
2570 1016 Pls
2599 890 Pls
2627 1177 Pls
2655 980 Pls
2683 1085 Pls
2711 1047 Pls
2740 1137 Pls
2768 1239 Pls
2796 1243 Pls
2824 1270 Pls
2853 1556 Pls
2881 1554 Pls
2909 1464 Pls
2937 1474 Pls
2965 1633 Pls
2994 1444 Pls
3022 1573 Pls
3050 1354 Pls
3078 1354 Pls
3106 1133 Pls
3135 1173 Pls
3163 1015 Pls
3191 935 Pls
3219 769 Pls
3248 844 Pls
3276 1163 Pls
3304 880 Pls
3332 1043 Pls
3360 1502 Pls
3389 1145 Pls
3417 1254 Pls
3445 1082 Pls
3473 1166 Pls
3502 1528 Pls
3530 1388 Pls
3558 1783 Pls
3586 1743 Pls
3614 1531 Pls
3643 1506 Pls
3671 1388 Pls
3699 1806 Pls
3727 1247 Pls
3756 1144 Pls
3784 974 Pls
3812 1095 Pls
3840 877 Pls
3868 958 Pls
3897 909 Pls
3925 996 Pls
3953 979 Pls
3981 789 Pls
4010 1083 Pls
4038 1108 Pls
4066 1276 Pls
4094 1264 Pls
4122 1200 Pls
4151 1216 Pls
4179 1425 Pls
4207 1521 Pls
4235 1446 Pls
4263 1388 Pls
4292 1634 Pls
4320 1392 Pls
4348 1324 Pls
4376 1474 Pls
4405 1340 Pls
4433 1161 Pls
4461 1064 Pls
4489 939 Pls
4517 963 Pls
4546 975 Pls
4251 3231 Pls
% End plot #1
% Begin plot #2
1.000 UP
4.000 UL
LT1
0.55 0.00 0.00 C LCb setrgbcolor
3896 3051 M
[ [(Helvetica) 180.0 0.0 true true 0 (0.2.3.25)]
] -60.0 MRshow
LT1
0.55 0.00 0.00 C 4004 3051 M
495 0 V
-495 31 R
0 -62 V
495 62 R
0 -62 V
990 1906 M
28 -539 V
28 80 V
29 21 V
28 -268 V
28 107 V
28 -95 V
29 -342 V
28 255 V
28 -62 V
28 298 V
28 -3 V
29 21 V
28 339 V
28 214 V
28 -149 V
29 487 V
28 -30 V
28 213 V
28 -73 V
28 129 V
29 -229 V
28 -156 V
28 -4 V
28 -434 V
28 20 V
29 -300 V
28 -210 V
28 4 V
28 -141 V
452 1657 R
28 -151 V
28 -25 V
29 -423 V
28 -159 V
28 -87 V
28 -730 V
28 43 V
29 -278 V
28 261 V
28 -111 V
28 -178 V
29 295 V
28 -28 V
28 405 V
28 513 V
28 66 V
29 -130 V
28 664 V
28 -441 V
28 115 V
29 311 V
28 36 V
28 60 V
28 15 V
28 -228 V
29 -110 V
28 32 V
28 -110 V
28 -564 V
28 -376 V
29 -44 V
28 -102 V
28 -79 V
28 -132 V
29 -33 V
28 29 V
28 299 V
28 370 V
28 -8 V
29 -121 V
28 268 V
28 -143 V
28 407 V
29 0 V
28 562 V
28 116 V
28 -168 V
28 -83 V
29 -216 V
28 106 V
28 -69 V
28 -540 V
29 -366 V
28 -120 V
28 -309 V
28 -248 V
28 246 V
29 357 V
28 -252 V
28 -37 V
28 -43 V
29 275 V
28 356 V
28 235 V
28 79 V
28 9 V
29 219 V
28 454 V
stroke 4179 2677 M
28 -216 V
28 60 V
28 -284 V
29 364 V
28 -52 V
28 -28 V
28 -261 V
29 -322 V
28 -356 V
28 -304 V
28 -154 V
28 -26 V
29 147 V
990 1599 M
0 634 V
959 1599 M
62 0 V
-62 634 R
62 0 V
-3 -1107 R
0 512 V
987 1126 M
62 0 V
-62 512 R
62 0 V
-3 -441 R
0 529 V
-31 -529 R
62 0 V
-62 529 R
62 0 V
-2 -507 R
0 526 V
-31 -526 R
62 0 V
-62 526 R
62 0 V
-3 -749 R
0 438 V
1072 996 M
62 0 V
-62 438 R
62 0 V
-3 -347 R
0 468 V
-31 -468 R
62 0 V
-62 468 R
62 0 V
-3 -547 R
0 438 V
-31 -438 R
62 0 V
-62 438 R
62 0 V
-2 -712 R
0 310 V
1157 734 M
62 0 V
-62 310 R
62 0 V
-3 -112 R
0 418 V
1185 932 M
62 0 V
-62 418 R
62 0 V
-3 -469 R
0 398 V
1213 881 M
62 0 V
-62 398 R
62 0 V
-3 -154 R
0 502 V
-31 -502 R
62 0 V
-62 502 R
62 0 V
-3 -497 R
0 485 V
-31 -485 R
62 0 V
-62 485 R
62 0 V
-2 -471 R
0 498 V
-31 -498 R
62 0 V
-62 498 R
62 0 V
-3 -206 R
0 587 V
-31 -587 R
62 0 V
-62 587 R
62 0 V
-3 -399 R
0 634 V
-31 -634 R
62 0 V
-62 634 R
62 0 V
-3 -754 R
0 577 V
stroke 1413 2081 M
-31 -577 R
62 0 V
-62 577 R
62 0 V
-2 -133 R
0 656 V
-31 -656 R
62 0 V
-62 656 R
62 0 V
-3 -690 R
0 663 V
-31 -663 R
62 0 V
-62 663 R
62 0 V
-3 -477 R
0 714 V
-31 -714 R
62 0 V
-62 714 R
62 0 V
-3 -762 R
0 665 V
-31 -665 R
62 0 V
-62 665 R
62 0 V
-3 -572 R
0 736 V
-31 -736 R
62 0 V
-62 736 R
62 0 V
-2 -929 R
0 667 V
-31 -667 R
62 0 V
-62 667 R
62 0 V
-3 -800 R
0 624 V
-31 -624 R
62 0 V
-62 624 R
62 0 V
-3 -648 R
0 665 V
-31 -665 R
62 0 V
-62 665 R
62 0 V
-3 -1047 R
0 567 V
-31 -567 R
62 0 V
-62 567 R
62 0 V
-3 -543 R
0 559 V
-31 -559 R
62 0 V
-62 559 R
62 0 V
-2 -832 R
0 513 V
-31 -513 R
62 0 V
-62 513 R
62 0 V
-3 -683 R
0 435 V
1721 994 M
62 0 V
-62 435 R
62 0 V
-3 -429 R
0 431 V
-31 -431 R
62 0 V
-62 431 R
62 0 V
-3 -552 R
0 395 V
1777 879 M
62 0 V
-62 395 R
62 0 V
421 1075 R
0 737 V
-31 -737 R
62 0 V
-62 737 R
62 0 V
-3 -879 R
0 721 V
-31 -721 R
62 0 V
-62 721 R
62 0 V
-3 -733 R
0 696 V
-31 -696 R
62 0 V
stroke 2347 2195 M
-62 696 R
62 0 V
-2 -1080 R
0 625 V
-31 -625 R
62 0 V
-62 625 R
62 0 V
-3 -776 R
0 613 V
-31 -613 R
62 0 V
-62 613 R
62 0 V
-3 -694 R
0 603 V
-31 -603 R
62 0 V
-62 603 R
62 0 V
2429 943 M
0 430 V
2398 943 M
62 0 V
-62 430 R
62 0 V
-3 -391 R
0 434 V
2426 982 M
62 0 V
-62 434 R
62 0 V
-2 -654 R
0 323 V
2455 762 M
62 0 V
-62 323 R
62 0 V
-3 -121 R
0 439 V
2483 964 M
62 0 V
-62 439 R
62 0 V
-3 -526 R
0 393 V
2511 877 M
62 0 V
-62 393 R
62 0 V
-3 -532 R
0 318 V
2539 738 M
62 0 V
-62 318 R
62 0 V
-2 -88 R
0 444 V
2568 968 M
62 0 V
-62 444 R
62 0 V
-3 -460 R
0 416 V
2596 952 M
62 0 V
-62 416 R
62 0 V
-3 -74 R
0 536 V
-31 -536 R
62 0 V
-62 536 R
62 0 V
-3 -88 R
0 658 V
-31 -658 R
62 0 V
-62 658 R
62 0 V
-3 -586 R
0 643 V
-31 -643 R
62 0 V
-62 643 R
62 0 V
-2 -767 R
0 634 V
-31 -634 R
62 0 V
-62 634 R
62 0 V
-3 -22 R
0 727 V
-31 -727 R
62 0 V
-62 727 R
62 0 V
-3 -1131 R
0 661 V
-31 -661 R
62 0 V
-62 661 R
62 0 V
stroke 2827 2559 M
-3 -567 R
0 701 V
-31 -701 R
62 0 V
-62 701 R
62 0 V
-2 -411 R
0 736 V
-31 -736 R
62 0 V
-62 736 R
62 0 V
-3 -692 R
0 721 V
-31 -721 R
62 0 V
-62 721 R
62 0 V
-3 -639 R
0 674 V
-31 -674 R
62 0 V
-62 674 R
62 0 V
-3 -688 R
0 733 V
-31 -733 R
62 0 V
-62 733 R
62 0 V
-3 -929 R
0 672 V
-31 -672 R
62 0 V
-62 672 R
62 0 V
-2 -796 R
0 703 V
-31 -703 R
62 0 V
-62 703 R
62 0 V
-3 -677 R
0 714 V
-31 -714 R
62 0 V
-62 714 R
62 0 V
-3 -819 R
0 707 V
-31 -707 R
62 0 V
-62 707 R
62 0 V
-3 -1217 R
0 609 V
-31 -609 R
62 0 V
-62 609 R
62 0 V
-3 -920 R
0 484 V
-31 -484 R
62 0 V
-62 484 R
62 0 V
-2 -534 R
0 499 V
-31 -499 R
62 0 V
-62 499 R
62 0 V
-3 -584 R
0 467 V
-31 -467 R
62 0 V
-62 467 R
62 0 V
-3 -528 R
0 431 V
3160 978 M
62 0 V
-62 431 R
62 0 V
-3 -543 R
0 394 V
3188 866 M
62 0 V
-62 394 R
62 0 V
-2 -418 R
0 378 V
3217 842 M
62 0 V
-62 378 R
62 0 V
-3 -356 R
0 392 V
3245 864 M
62 0 V
-62 392 R
62 0 V
-3 -145 R
0 489 V
stroke 3304 1600 M
-31 -489 R
62 0 V
-62 489 R
62 0 V
-3 -167 R
0 579 V
-31 -579 R
62 0 V
-62 579 R
62 0 V
-3 -578 R
0 558 V
-31 -558 R
62 0 V
-62 558 R
62 0 V
-2 -668 R
0 540 V
-31 -540 R
62 0 V
-62 540 R
62 0 V
-3 -318 R
0 629 V
-31 -629 R
62 0 V
-62 629 R
62 0 V
-3 -748 R
0 582 V
-31 -582 R
62 0 V
-62 582 R
62 0 V
-3 -202 R
0 629 V
-31 -629 R
62 0 V
-62 629 R
62 0 V
-2 -651 R
0 673 V
-31 -673 R
62 0 V
-62 673 R
62 0 V
-3 -106 R
0 652 V
-31 -652 R
62 0 V
-62 652 R
62 0 V
-3 -578 R
0 733 V
-31 -733 R
62 0 V
-62 733 R
62 0 V
-3 -899 R
0 733 V
-31 -733 R
62 0 V
-62 733 R
62 0 V
-3 -794 R
0 689 V
-31 -689 R
62 0 V
-62 689 R
62 0 V
-2 -892 R
0 669 V
-31 -669 R
62 0 V
-62 669 R
62 0 V
-3 -579 R
0 698 V
-31 -698 R
62 0 V
-62 698 R
62 0 V
-3 -773 R
0 713 V
-31 -713 R
62 0 V
-62 713 R
62 0 V
-3 -1197 R
0 610 V
-31 -610 R
62 0 V
-62 610 R
62 0 V
-2 -927 R
0 520 V
-31 -520 R
62 0 V
-62 520 R
62 0 V
-3 -623 R
0 486 V
-31 -486 R
62 0 V
stroke 3815 1107 M
-62 486 R
62 0 V
-3 -738 R
0 379 V
3781 855 M
62 0 V
-62 379 R
62 0 V
-3 -565 R
0 258 V
3809 669 M
62 0 V
-62 258 R
62 0 V
-3 -74 R
0 377 V
3837 853 M
62 0 V
-62 377 R
62 0 V
-2 -86 R
0 506 V
-31 -506 R
62 0 V
-62 506 R
62 0 V
-3 -714 R
0 422 V
3894 936 M
62 0 V
-62 422 R
62 0 V
-3 -454 R
0 412 V
3922 904 M
62 0 V
-62 412 R
62 0 V
-3 -440 R
0 379 V
3950 876 M
62 0 V
-62 379 R
62 0 V
-2 -159 R
0 487 V
-31 -487 R
62 0 V
-62 487 R
62 0 V
-3 -168 R
0 553 V
-31 -553 R
62 0 V
-62 553 R
62 0 V
-3 -362 R
0 639 V
-31 -639 R
62 0 V
-62 639 R
62 0 V
-3 -566 R
0 649 V
-31 -649 R
62 0 V
-62 649 R
62 0 V
-3 -636 R
0 641 V
-31 -641 R
62 0 V
-62 641 R
62 0 V
-2 -427 R
0 645 V
-31 -645 R
62 0 V
-62 645 R
62 0 V
-3 -237 R
0 731 V
-31 -731 R
62 0 V
-62 731 R
62 0 V
-3 -917 R
0 674 V
-31 -674 R
62 0 V
-62 674 R
62 0 V
-3 -623 R
0 691 V
-31 -691 R
62 0 V
-62 691 R
62 0 V
-3 -954 R
0 653 V
-31 -653 R
62 0 V
-62 653 R
62 0 V
stroke 4294 2569 M
-2 -320 R
0 710 V
-31 -710 R
62 0 V
-62 710 R
62 0 V
-3 -778 R
0 743 V
-31 -743 R
62 0 V
-62 743 R
62 0 V
-3 -736 R
0 673 V
-31 -673 R
62 0 V
-62 673 R
62 0 V
-3 -922 R
0 653 V
-31 -653 R
62 0 V
-62 653 R
62 0 V
-2 -955 R
0 621 V
-31 -621 R
62 0 V
-62 621 R
62 0 V
-3 -937 R
0 547 V
-31 -547 R
62 0 V
-62 547 R
62 0 V
-3 -802 R
0 452 V
-31 -452 R
62 0 V
-62 452 R
62 0 V
-3 -583 R
0 410 V
4458 935 M
62 0 V
-62 410 R
62 0 V
-3 -431 R
0 399 V
4486 914 M
62 0 V
-62 399 R
62 0 V
-2 -286 R
0 467 V
-31 -467 R
62 0 V
-62 467 R
62 0 V
990 1906 Crs
1018 1367 Crs
1046 1447 Crs
1075 1468 Crs
1103 1200 Crs
1131 1307 Crs
1159 1212 Crs
1188 870 Crs
1216 1125 Crs
1244 1063 Crs
1272 1361 Crs
1300 1358 Crs
1329 1379 Crs
1357 1718 Crs
1385 1932 Crs
1413 1783 Crs
1442 2270 Crs
1470 2240 Crs
1498 2453 Crs
1526 2380 Crs
1554 2509 Crs
1583 2280 Crs
1611 2124 Crs
1639 2120 Crs
1667 1686 Crs
1695 1706 Crs
1724 1406 Crs
1752 1196 Crs
1780 1200 Crs
1808 1059 Crs
2260 2716 Crs
2288 2565 Crs
2316 2540 Crs
2345 2117 Crs
2373 1958 Crs
2401 1871 Crs
2429 1141 Crs
2457 1184 Crs
2486 906 Crs
2514 1167 Crs
2542 1056 Crs
2570 878 Crs
2599 1173 Crs
2627 1145 Crs
2655 1550 Crs
2683 2063 Crs
2711 2129 Crs
2740 1999 Crs
2768 2663 Crs
2796 2222 Crs
2824 2337 Crs
2853 2648 Crs
2881 2684 Crs
2909 2744 Crs
2937 2759 Crs
2965 2531 Crs
2994 2421 Crs
3022 2453 Crs
3050 2343 Crs
3078 1779 Crs
3106 1403 Crs
3135 1359 Crs
3163 1257 Crs
3191 1178 Crs
3219 1046 Crs
3248 1013 Crs
3276 1042 Crs
3304 1341 Crs
3332 1711 Crs
3360 1703 Crs
3389 1582 Crs
3417 1850 Crs
3445 1707 Crs
3473 2114 Crs
3502 2114 Crs
3530 2676 Crs
3558 2792 Crs
3586 2624 Crs
3614 2541 Crs
3643 2325 Crs
3671 2431 Crs
3699 2362 Crs
3727 1822 Crs
3756 1456 Crs
3784 1336 Crs
3812 1027 Crs
3840 779 Crs
3868 1025 Crs
3897 1382 Crs
3925 1130 Crs
3953 1093 Crs
3981 1050 Crs
4010 1325 Crs
4038 1681 Crs
4066 1916 Crs
4094 1995 Crs
4122 2004 Crs
4151 2223 Crs
4179 2677 Crs
4207 2461 Crs
4235 2521 Crs
4263 2237 Crs
4292 2601 Crs
4320 2549 Crs
4348 2521 Crs
4376 2260 Crs
4405 1938 Crs
4433 1582 Crs
4461 1278 Crs
4489 1124 Crs
4517 1098 Crs
4546 1245 Crs
4251 3051 Crs
% End plot #2
1.000 UL
LTb
LCb setrgbcolor
990 3384 N
990 576 L
3725 0 V
0 2808 V
-3725 0 V
Z stroke
1.000 UP
1.000 UL
LTb
LCb setrgbcolor
stroke
grestore
end
showpage
%%Trailer
%%DocumentFonts: Helvetica
%%Pages: 1
