GitLab is used only for code review, issue tracking and project management. Canonical locations for source code are still https://gitweb.torproject.org/ https://git.torproject.org/ and git-rw.torproject.org.

Merge branch 'bug40168-035' into bug40168

9 jobs for bug40168 in 42 minutes and 19 seconds (queued for 42 seconds)
latest
Status Job ID Name Coverage
  Test
failed #4927
debian-disable-dirauth

00:09:08

failed #4928
debian-disable-relay

00:04:37

failed #4923
debian-distcheck

00:07:01

passed #4924
debian-docs

00:04:36

passed #4922
debian-hardened

00:20:41

failed #4925
debian-integration

00:04:49

failed #4921
debian-minimal

00:04:43

failed #4929
debian-nss

00:09:03

failed #4926
debian-tracing

00:04:49

 
Name Stage Failure
failed
debian-nss Test
make[1]: Leaving directory '/builds/mikeperry/tor/build'
make: *** [Makefile:7334: all] Error 2
ERROR: command 'make -j4 -k all' has failed.
Uploading artifacts for failed job
Uploading artifacts...
artifacts/: found 1 matching files and directories

Uploading artifacts as "archive" to coordinator... ok
id=4929 responseStatus=201 Created token=k97G4Yyb
Cleaning up file based variables
ERROR: Job failed: exit code 1
failed
debian-disable-relay Test
make[1]: Target 'all-am' not remade because of errors.
make[1]: Leaving directory '/builds/mikeperry/tor/build'
make: *** [Makefile:7334: all] Error 2
ERROR: command 'make -j4 -k all' has failed.
Uploading artifacts for failed job
Uploading artifacts...
artifacts/: found 1 matching files and directories

Uploading artifacts as "archive" to coordinator... ok
id=4928 responseStatus=201 Created token=KoWCLedj
ERROR: Job failed: exit code 1
failed
debian-disable-dirauth Test
make[1]: Leaving directory '/builds/mikeperry/tor/build'
make: *** [Makefile:7334: all] Error 2
ERROR: command 'make -j4 -k all' has failed.
Uploading artifacts for failed job
Uploading artifacts...
artifacts/: found 1 matching files and directories

Uploading artifacts as "archive" to coordinator... ok
id=4927 responseStatus=201 Created token=dmAvJgX2
Cleaning up file based variables
ERROR: Job failed: exit code 1
failed
debian-tracing Test
make[1]: Leaving directory '/builds/mikeperry/tor/build'
make[1]: Target 'all-am' not remade because of errors.
make: *** [Makefile:7334: all] Error 2
ERROR: command 'make -j4 -k all' has failed.
Uploading artifacts for failed job
Uploading artifacts...
artifacts/: found 1 matching files and directories

Uploading artifacts as "archive" to coordinator... ok
id=4926 responseStatus=201 Created token=xCxYJe_a
ERROR: Job failed: exit code 1
failed
debian-integration Test
make[1]: Target 'all-am' not remade because of errors.
make: *** [Makefile:7334: all] Error 2
make[1]: Leaving directory '/builds/mikeperry/tor/build'
ERROR: command 'make -j4 -k all' has failed.
Uploading artifacts for failed job
Uploading artifacts...
artifacts/: found 1 matching files and directories

Uploading artifacts as "archive" to coordinator... ok
id=4925 responseStatus=201 Created token=T1u9Jgyx
ERROR: Job failed: exit code 1
failed
debian-distcheck Test
/bin/bash: line 1: file: command not found
make: *** [Makefile:25702: show-distdir-core] Error 127
ERROR: command 'make show-distdir-core' has failed.
FATAL ERROR: Unable to continue.
Uploading artifacts for failed job
Uploading artifacts...
artifacts/: found 1 matching files and directories

Uploading artifacts as "archive" to coordinator... ok
id=4923 responseStatus=201 Created token=GEd_s2M5
ERROR: Job failed: exit code 1
failed
debian-minimal Test
make[1]: Target 'all-am' not remade because of errors.
make[1]: Leaving directory '/builds/mikeperry/tor/build'
make: *** [Makefile:7334: all] Error 2
ERROR: command 'make -j4 -k all' has failed.
Uploading artifacts for failed job
Uploading artifacts...
artifacts/: found 1 matching files and directories

Uploading artifacts as "archive" to coordinator... ok
id=4921 responseStatus=201 Created token=Y9cDcdjR
ERROR: Job failed: exit code 1