GitLab is used only for code review, issue tracking and project management. Canonical locations for source code are still https://gitweb.torproject.org/ https://git.torproject.org/ and git-rw.torproject.org.

Merge branch 'bug40168+34088-035-v2' into bug40168+34088-v2

9 jobs for bug40168+34088-v2 in 44 minutes and 51 seconds (queued for 2 minutes and 11 seconds)
latest
Status Job ID Name Coverage
  Test
failed #6323
debian-disable-dirauth

00:08:04

failed #6324
debian-disable-relay

00:06:18

failed #6319
debian-distcheck

00:12:34

passed #6320
debian-docs

00:06:37

passed #6318
debian-hardened

00:10:39

failed #6321
debian-integration

00:08:53

failed #6317
debian-minimal

00:09:32

failed #6325
debian-nss

00:04:30

failed #6322
debian-tracing

00:10:25

 
Name Stage Failure
failed
debian-nss Test
make[1]: Leaving directory '/builds/mikeperry/tor/build'
make: *** [Makefile:7340: all] Error 2
ERROR: command 'make -j4 -k all' has failed.
Uploading artifacts for failed job
Uploading artifacts...
artifacts/: found 1 matching files and directories

Uploading artifacts as "archive" to coordinator... ok
id=6325 responseStatus=201 Created token=Cs21P2km
Cleaning up file based variables
ERROR: Job failed: exit code 1
failed
debian-disable-dirauth Test
make[1]: Leaving directory '/builds/mikeperry/tor/build'
make: *** [Makefile:7340: all] Error 2
ERROR: command 'make -j4 -k all' has failed.
Uploading artifacts for failed job
Uploading artifacts...
artifacts/: found 1 matching files and directories

Uploading artifacts as "archive" to coordinator... ok
id=6323 responseStatus=201 Created token=DyzJC5Bc
Cleaning up file based variables
ERROR: Job failed: exit code 1
failed
debian-disable-relay Test
make[1]: Target 'all-am' not remade because of errors.
make: *** [Makefile:7340: all] Error 2
ERROR: command 'make -j4 -k all' has failed.
Uploading artifacts for failed job
Uploading artifacts...
artifacts/: found 1 matching files and directories

Uploading artifacts as "archive" to coordinator... ok
id=6324 responseStatus=201 Created token=n1dCUyyx
Cleaning up file based variables
ERROR: Job failed: exit code 1
failed
debian-tracing Test
make: *** [Makefile:25709: show-distdir-core] Error 127
ERROR: command 'make show-distdir-core' has failed.
FATAL ERROR: Unable to continue.
Uploading artifacts for failed job
Uploading artifacts...
artifacts/: found 1 matching files and directories

Uploading artifacts as "archive" to coordinator... ok
id=6322 responseStatus=201 Created token=qZkE-xzy
Cleaning up file based variables
ERROR: Job failed: exit code 1
failed
debian-integration Test
make[1]: Leaving directory '/builds/mikeperry/tor/build'
make: *** [Makefile:7340: all] Error 2
ERROR: command 'make -j4 -k all' has failed.
Uploading artifacts for failed job
Uploading artifacts...
artifacts/: found 1 matching files and directories

Uploading artifacts as "archive" to coordinator... ok
id=6321 responseStatus=201 Created token=bQfADnmK
Cleaning up file based variables
ERROR: Job failed: exit code 1
failed
debian-distcheck Test
make: *** [Makefile:25709: show-distdir-core] Error 127
ERROR: command 'make show-distdir-core' has failed.
FATAL ERROR: Unable to continue.
Uploading artifacts for failed job
Uploading artifacts...
artifacts/: found 1 matching files and directories

Uploading artifacts as "archive" to coordinator... ok
id=6319 responseStatus=201 Created token=Pe1d4jmq
Cleaning up file based variables
ERROR: Job failed: exit code 1
failed
debian-minimal Test
make[1]: Leaving directory '/builds/mikeperry/tor/build'
make: *** [Makefile:7340: all] Error 2
ERROR: command 'make -j4 -k all' has failed.
Uploading artifacts for failed job
Uploading artifacts...
artifacts/: found 1 matching files and directories

Uploading artifacts as "archive" to coordinator... ok
id=6317 responseStatus=201 Created token=GQgmYwa3
Cleaning up file based variables
ERROR: Job failed: exit code 1