Simplify checks for vg-lite.

9 jobs for vanguards-lite-dev in 13 minutes and 3 seconds (queued for 3 seconds)
Status Job ID Name Coverage
  Test
failed #19722
debian-disable-dirauth

00:04:44

failed #19723
debian-disable-relay

00:04:33

failed #19718
debian-distcheck

00:06:01

passed #19719
debian-docs

00:03:02

passed #19717
debian-hardened

00:07:42

failed #19720
debian-integration

00:07:24

failed #19716
debian-minimal

00:04:35

failed #19724
debian-nss

00:03:43

failed #19721
debian-tracing

00:06:25

 
Name Stage Failure
failed
debian-nss Test
make[1]: Leaving directory '/builds/mikeperry/tor/build'
make: *** [Makefile:7174: all] Error 2
ERROR: command 'make -j4 -k all' has failed.
Uploading artifacts for failed job
Uploading artifacts...
artifacts/: found 1 matching files and directories

Uploading artifacts as "archive" to coordinator... ok
id=19724 responseStatus=201 Created token=h6NGNNVT
Cleaning up file based variables
ERROR: Job failed: exit code 1
failed
debian-disable-relay Test
make[1]: Leaving directory '/builds/mikeperry/tor/build'
make: *** [Makefile:7174: all] Error 2
ERROR: command 'make -j4 -k all' has failed.
Uploading artifacts for failed job
Uploading artifacts...
artifacts/: found 1 matching files and directories

Uploading artifacts as "archive" to coordinator... ok
id=19723 responseStatus=201 Created token=qpZJMseE
Cleaning up file based variables
ERROR: Job failed: exit code 1
failed
debian-disable-dirauth Test
make[1]: Leaving directory '/builds/mikeperry/tor/build'
make: *** [Makefile:7174: all] Error 2
ERROR: command 'make -j4 -k all' has failed.
Uploading artifacts for failed job
Uploading artifacts...
artifacts/: found 1 matching files and directories

Uploading artifacts as "archive" to coordinator... ok
id=19722 responseStatus=201 Created token=55NfJ3Cx
Cleaning up file based variables
ERROR: Job failed: exit code 1
failed
debian-tracing Test
make: *** [Makefile:25147: show-distdir-core] Error 127
ERROR: command 'make show-distdir-core' has failed.
FATAL ERROR: Unable to continue.
Uploading artifacts for failed job
Uploading artifacts...
artifacts/: found 1 matching files and directories

Uploading artifacts as "archive" to coordinator... ok
id=19721 responseStatus=201 Created token=HY9LNjJM
Cleaning up file based variables
ERROR: Job failed: exit code 1
failed
debian-integration Test
make[1]: Leaving directory '/builds/mikeperry/tor/build'
make: *** [Makefile:7174: all] Error 2
ERROR: command 'make -j4 -k all' has failed.
Uploading artifacts for failed job
Uploading artifacts...
artifacts/: found 1 matching files and directories

Uploading artifacts as "archive" to coordinator... ok
id=19720 responseStatus=201 Created token=f8zTxH6y
Cleaning up file based variables
ERROR: Job failed: exit code 1
failed
debian-distcheck Test
make: *** [Makefile:25147: show-distdir-core] Error 127
ERROR: command 'make show-distdir-core' has failed.
FATAL ERROR: Unable to continue.
Uploading artifacts for failed job
Uploading artifacts...
artifacts/: found 1 matching files and directories

Uploading artifacts as "archive" to coordinator... ok
id=19718 responseStatus=201 Created token=hUB5SPST
Cleaning up file based variables
ERROR: Job failed: exit code 1
failed
debian-minimal Test
make[1]: Leaving directory '/builds/mikeperry/tor/build'
make: *** [Makefile:7174: all] Error 2
ERROR: command 'make -j4 -k all' has failed.
Uploading artifacts for failed job
Uploading artifacts...
artifacts/: found 1 matching files and directories

Uploading artifacts as "archive" to coordinator... ok
id=19716 responseStatus=201 Created token=5d6VGyWL
Cleaning up file based variables
ERROR: Job failed: exit code 1