GitLab is used only for code review, issue tracking and project management. Canonical locations for source code are still https://gitweb.torproject.org/ https://git.torproject.org/ and git-rw.torproject.org.

Changes file.

9 jobs for vanguards-lite-dev in 12 minutes and 31 seconds (queued for 1 second)
Status Job ID Name Coverage
  Test
failed #19733
debian-disable-dirauth

00:04:43

failed #19734
debian-disable-relay

00:04:40

failed #19729
debian-distcheck

00:05:44

passed #19730
debian-docs

00:02:51

failed #19728
debian-hardened

00:05:37

failed #19731
debian-integration

00:04:53

failed #19727
debian-minimal

00:04:24

failed #19735
debian-nss

00:04:45

failed #19732
debian-tracing

00:06:03

 
Name Stage Failure
failed
debian-nss Test
make[1]: Leaving directory '/builds/mikeperry/tor/build'
make: *** [Makefile:7174: all] Error 2
ERROR: command 'make -j4 -k all' has failed.
Uploading artifacts for failed job
Uploading artifacts...
artifacts/: found 1 matching files and directories

Uploading artifacts as "archive" to coordinator... ok
id=19735 responseStatus=201 Created token=UYSPkrT4
Cleaning up file based variables
ERROR: Job failed: exit code 1
failed
debian-tracing Test
make: *** [Makefile:25147: show-distdir-core] Error 127
ERROR: command 'make show-distdir-core' has failed.
FATAL ERROR: Unable to continue.
Uploading artifacts for failed job
Uploading artifacts...
artifacts/: found 1 matching files and directories

Uploading artifacts as "archive" to coordinator... ok
id=19732 responseStatus=201 Created token=t2sjC2j5
Cleaning up file based variables
ERROR: Job failed: exit code 1
failed
debian-disable-relay Test
make[1]: Leaving directory '/builds/mikeperry/tor/build'
make: *** [Makefile:7174: all] Error 2
ERROR: command 'make -j4 -k all' has failed.
Uploading artifacts for failed job
Uploading artifacts...
artifacts/: found 1 matching files and directories

Uploading artifacts as "archive" to coordinator... ok
id=19734 responseStatus=201 Created token=nxdYVzfB
Cleaning up file based variables
ERROR: Job failed: exit code 1
failed
debian-disable-dirauth Test
make[1]: Leaving directory '/builds/mikeperry/tor/build'
make: *** [Makefile:7174: all] Error 2
ERROR: command 'make -j4 -k all' has failed.
Uploading artifacts for failed job
Uploading artifacts...
artifacts/: found 1 matching files and directories

Uploading artifacts as "archive" to coordinator... ok
id=19733 responseStatus=201 Created token=5Sysbk6X
Cleaning up file based variables
ERROR: Job failed: exit code 1
failed
debian-integration Test
make[1]: Leaving directory '/builds/mikeperry/tor/build'
make: *** [Makefile:7174: all] Error 2
ERROR: command 'make -j4 -k all' has failed.
Uploading artifacts for failed job
Uploading artifacts...
artifacts/: found 1 matching files and directories

Uploading artifacts as "archive" to coordinator... ok
id=19731 responseStatus=201 Created token=y-gfu3yd
Cleaning up file based variables
ERROR: Job failed: exit code 1
failed
debian-distcheck Test
make: *** [Makefile:25147: show-distdir-core] Error 127
ERROR: command 'make show-distdir-core' has failed.
FATAL ERROR: Unable to continue.
Uploading artifacts for failed job
Uploading artifacts...
artifacts/: found 1 matching files and directories

Uploading artifacts as "archive" to coordinator... ok
id=19729 responseStatus=201 Created token=p3gyyhqh
Cleaning up file based variables
ERROR: Job failed: exit code 1
failed
debian-hardened Test
make[1]: Leaving directory '/builds/mikeperry/tor/build'
make: *** [Makefile:7177: all] Error 2
ERROR: command 'make -j4 -k all' has failed.
Uploading artifacts for failed job
Uploading artifacts...
artifacts/: found 1 matching files and directories

Uploading artifacts as "archive" to coordinator... ok
id=19728 responseStatus=201 Created token=ZzGwUDEd
Cleaning up file based variables
ERROR: Job failed: exit code 1
failed
debian-minimal Test
make[1]: Leaving directory '/builds/mikeperry/tor/build'
make: *** [Makefile:7174: all] Error 2
ERROR: command 'make -j4 -k all' has failed.
Uploading artifacts for failed job
Uploading artifacts...
artifacts/: found 1 matching files and directories

Uploading artifacts as "archive" to coordinator... ok
id=19727 responseStatus=201 Created token=Whuf85Kz
Cleaning up file based variables
ERROR: Job failed: exit code 1