Bump version number to 0.12.0

2 jobs for bridgedb-0.12.0 in 3 minutes and 31 seconds (queued for 2 seconds)
latest
Status Job ID Name Coverage
  Test
failed #21054
allowed to fail
pycodestyle

00:00:23

failed #21053
test

00:03:31

 
Name Stage Failure
failed
test Test

bridgedb.test.test_https_server.HowtoResourceTests.test_HowtoResource_render_GET_lang_ru
-------------------------------------------------------------------------------
Ran 970 tests in 115.158s

FAILED (skips=9, failures=1, successes=960)
make: *** [Makefile:78: coverage-test] Error 1
Cleaning up file based variables
ERROR: Job failed: exit code 1
failed
pycodestyle Test
bridgedb/parse/options.py:283:80: E501 line too long (80 > 79 characters)
bridgedb/parse/options.py:284:80: E501 line too long (81 > 79 characters)
bridgedb/parse/options.py:286:80: E501 line too long (81 > 79 characters)
bridgedb/parse/versions.py:95:22: E221 multiple spaces before operator
bridgedb/parse/versions.py:96:22: E221 multiple spaces before operator
bridgedb/parse/versions.py:97:22: E221 multiple spaces before operator
make: *** [Makefile:26: pycodestyle] Error 1
Cleaning up file based variables
ERROR: Job failed: exit code 1