{
  "appDesc": {
    "message": "Snowflake on WebRTC-sisendiga transport Torile."
  },
  "popupTurnOn": {
    "message": "Lülita sisse"
  },
  "popupTurnOff": {
    "message": "Lülita välja"
  },
  "popupLearnMore": {
    "message": "Loe lisaks"
  },
  "popupStatusOff": {
    "message": "Snowflake on väljas"
  },
  "popupStatusOn": {
    "message": "$1 klienti ühendatud."
  },
  "popupWebRTCOff": {
    "message": "WebRTC funktsiooni ei tuvastatud."
  },
  "popupDescOn": {
    "message": "Sinu snowflake on aidanud $1 kasutajal hiilida tsensuurist mööda viimase 24 tunni jooksul."
  }
}
