{
  "appDesc": {
    "message": "O Snowflake é um transporte conectável WebRTC para o Tor."
  },
  "popupTurnOn": {
    "message": "Ligar"
  },
  "popupTurnOff": {
    "message": "Desligar"
  },
  "popupLearnMore": {
    "message": "Saber mais"
  },
  "popupStatusOff": {
    "message": "Snowflake está desligado"
  },
  "popupStatusOn": {
    "message": "$1 clientes conectados."
  },
  "popupWebRTCOff": {
    "message": "O recurso WebRTC não é detectado."
  },
  "popupDescOn": {
    "message": "Seu snowflake ajudou $1 os usuários contornam a censura nas últimas 24 horas."
  }
}
