{
  "appDesc": {
    "message": "Snowflake is a WebRTC pluggable transport for Tor."
  },
  "popupTurnOn": {
    "message": "Piztu"
  },
  "popupTurnOff": {
    "message": "Itzali"
  },
  "popupLearnMore": {
    "message": "Gehiago jakin"
  },
  "popupStatusOff": {
    "message": "Snowflake is off"
  },
  "popupStatusOn": {
    "message": "$1 bezero konektatuta."
  },
  "popupWebRTCOff": {
    "message": "WebRTC ezaugarria ez da detektatu."
  },
  "popupDescOn": {
    "message": "Your snowflake has helped $1 users circumvent censorship in the last 24 hours."
  }
}
