{
  "appDesc": {
    "message": "Snowflake és un complement per al Tor, basat en WebRTC."
  },
  "popupTurnOn": {
    "message": "Habilita"
  },
  "popupTurnOff": {
    "message": "Inhabilita"
  },
  "popupLearnMore": {
    "message": "Més informació"
  },
  "popupStatusOff": {
    "message": "Snowflake està desactivat"
  },
  "popupStatusOn": {
    "message": "$1 clients connectats."
  },
  "popupWebRTCOff": {
    "message": "No s'ha detectat la característica WebRTC."
  },
  "popupDescOn": {
    "message": "El vostre snowflake ha ajudat a $1 usuaris a evitar la censura durant les darreres 24 hores."
  }
}
