-----BEGIN PGP SIGNATURE-----

iHUEABYKAB0WIQRRQQJFTQqH2wdnoeu+agUxwYqReQUCZUT8BgAKCRC+agUxwYqR
eaIgAQD/UgZQbDRpf7WorRX06QGkHLx1DkLzeLtYwe5EkgmLUgD/dGwbzVKdYA6E
Y/0hiKkF0mKf3tN1L4lf6yz8YSqH+w0=
=c3iP
-----END PGP SIGNATURE-----
