-----BEGIN PGP SIGNATURE-----

iQEzBAABCAAdFiEEt0QX7d8irJ+ekPSRQuhqKhH0jTYFAmL2ZUsACgkQQuhqKhH0
jTZI5Af/TYCfibczU4h/OZtmAJBnwYMUvp+d7hMUxhLyjZgnDYbgACielKLd8SmU
ufV7by7XETZ0nc5dfWfR27nu7V3r9rZF6NGj/RLydnq56d/QRrU1naeYPsNU44lh
1tFNG4LfGd6gqs9OcwUuQxMiRwnxohLLwqoapiljgtd/bu03yX7XGpma6JeRphRZ
r6K/CY1QZM27XEwdCAWctD4rxNUpfB2Sq3KKsV2EDi5yjqQ1Uxl8hJNRz+Hxxgdv
E6b4mRI5ocA3rvYecsMb0cwJe3aHrnqpOM20pX3FUukJzuZIvul1OZ3zfTz7ieBK
tkEO4CXMiKEbLSs/SNk+Ou7XD4bxHg==
=UfUE
-----END PGP SIGNATURE-----
