-----BEGIN PGP SIGNATURE-----

iQEzBAABCAAdFiEEt0QX7d8irJ+ekPSRQuhqKhH0jTYFAmPANQcACgkQQuhqKhH0
jTaNzQf8DkjM8Hx0Aotby8sGoBN/lgBsuJc2+DWpQZSLjqczJVpthzWBkygzETgb
/u8Iqc+Wm3gKTl0HqX8BjTGf24RJmpnFHOXLjOkw0SgM5rGhSMcbY6u2e5dJOq94
Ra8JL8fpKobIKb/uppcuCbGW9BOr9tgfWTQr6od/VJhVDsfG1/TtHZIVdwj5yQ7d
hPX3UHwE7UCmTCMl5I5H82q/KV+LKDP5FnkyYkqkM9I7VeWH94BhKUf1FFF+F7kJ
3FfQXtNRr996jcW4uqw7F29cv6WjMAJWhrM5L5ETk2FsrybhTiz52VFm7xw+vJNO
Qj/72DOMsjPa4IhvUuDEwlJZFTwX7g==
=fMtL
-----END PGP SIGNATURE-----
