-----BEGIN PGP SIGNATURE-----

iQEzBAABCAAdFiEEt0QX7d8irJ+ekPSRQuhqKhH0jTYFAmG7WWQACgkQQuhqKhH0
jTbMAQf6A7pP3guGq6cOj2VJUd9GyTM928WBYQwTSvt49+5hpzIq3f5atQXThix3
ZNNtemCmQugMn5WB1EY/OB3p/A2dGVzSf/FVPSN7SJ67pGz1QYHoxfd8iErxpqkd
xvQce3863SrUv3fKqvlv1guyBiMOTZ70vP9+lDMuQMMNKUHKKF2cUgRvAHlbdts4
vdDjnhLe1yjVTemR918iwpWJ+ErvFGqTx20gTdlCuBOQXeXVZ7N0k28WYcVQBUmQ
Xhs2alDvq6XGXWod86mLcnIgHHD2WnXu+S6crY6VBCsK1lLHAzsh0hGFf4gkjaOp
dASbutv1XPM5wv81XeO/gQHHUvrk6Q==
=aAJ/
-----END PGP SIGNATURE-----
