-----BEGIN PGP SIGNATURE-----

iHUEABYKAB0WIQRRQQJFTQqH2wdnoeu+agUxwYqReQUCYf1cjAAKCRC+agUxwYqR
eZY6AQCk83zSeummikPUzoYtNgGuXWC7NO0i8HavIdTXf62oHgEA9f27skY4IHfR
oAYfKPzwNpZnxM1QoTX0YomrvcT/Rgk=
=GAey
-----END PGP SIGNATURE-----
