-----BEGIN PGP SIGNATURE-----

iHUEABYKAB0WIQRRQQJFTQqH2wdnoeu+agUxwYqReQUCZUz0UgAKCRC+agUxwYqR
eb/HAP45sC9TPfYZgYE/4tf28YuXCJ+7u2qmwz9dF71Ug9rc/wEAkydu9XnpmL83
rs4xebAE+s6DIYGkQhhoVFPSTKyulwI=
=A7kt
-----END PGP SIGNATURE-----
