-----BEGIN PGP SIGNATURE-----

iQEzBAABCAAdFiEEt0QX7d8irJ+ekPSRQuhqKhH0jTYFAmTBLloACgkQQuhqKhH0
jTarhggAjzqER5NXDPFqNYrh2qiOb8bdKtEWqxMNY6M+LfiOaOmbvlASADdzhyCy
nzST/UyjBkNiGQ0V14xyJ3c2V78ibl0HG2+y/rySx9I9kxtM3lg9pu9w3d2tB0C3
b4M3P6Gy0OeqbtY4SZM6cQi1Wt7fCejL78fD/eNUtqk43sewzY5AtINm74OnK4uA
rcQnpjhEiAp3CY5NCJW0p+XrsiPPahwcdSJnjpZ4O6v4wm3Hr4Q/VpkMnjmBHsr7
btQApXn37hVunZUXzNOVK40yoVc6hvFuw+AmFfadszvbYV2cerXwKz26okvYRXrE
Au4Qm64SDrlLrnU5j7z/QXej3PeZ2g==
=C3bg
-----END PGP SIGNATURE-----
