@startuml

title Views and functions dependencies


folder legend {
    entity table
    [materialized view]
    rectangle view
    (function)
}

file bandwidth_views {
    entity bandwidth_file
    entity bandwidth_record
    [bw_line] --> bandwidth_file
    bw_line --> bandwidth_record
    [scanner_country] --> bw_line
    (get_last_nick) --> bw_line
    (bw_avgs) --> bw_line
    (lowest_ratio_highest_advertised_bw) --> bw_avgs
    (lowest_ratio_highest_weight) --> bw_avgs
    (highest_advertised_bw_lowest_ratio) --> bw_avgs
    (highest_weight_lowest_ratio) --> bw_avgs
    (weight_gt_stream) --> bw_avgs
}

file onionperf_views {
    entity onionperf_measurement
    rectangle fps_as_middle
    fps_as_middle --> onionperf_measurement
    rectangle fps_as_guard
    fps_as_guard --> onionperf_measurement
    fps_as_guard --> fps_as_middle
    rectangle fps_as_middle_or_guard
    fps_as_middle_or_guard --> fps_as_guard
    fps_as_middle_or_guard --> fps_as_middle
    rectangle fps_as_exit
    fps_as_exit --> onionperf_measurement
    fps_as_exit --> fps_as_middle_or_guard
    rectangle as_middles
    as_middles --> onionperf_measurement
    as_middles --> fps_as_middle
    rectangle as_guards
    as_guards --> onionperf_measurement
    as_guards --> fps_as_guard
    rectangle as_exits
    as_exits --> onionperf_measurement
    as_exits --> fps_as_exit
    rectangle relay_througput
    relay_througput --> as_middles
    relay_througput --> as_guards
    relay_througput --> as_exits
    rectangle relay_throughput_avg
    relay_throughput_avg --> relay_througput
    [relay_throughput_avg_filt] --> relay_throughput_avg
    [net_throughput] --> relay_throughput_avg_filt
    [relay_throughput_ratio] --> net_throughput
    [relay_throughput_ratio] --> relay_throughput_avg_filt
    [onionperf_nodes] --> onionperf_measurement
    (throughput_avgs) --> relay_throughput_ratio
}

file network_status_flags_views {
    entity network_status_entry
    rectangle relay_type
    rectangle flags
    relay_type --> network_status_entry
    flags -->  network_status_entry
    (distinct_flags) --> flags
    (sum_relays_flag) --> distinct_flags
}

file several_tables_functions {
    entity server_status
    (stream_gt_throughput) --> bw_avgs
    (stream_gt_throughput) --> throughput_avgs
    (relay_other_data) --> server_status
    (relay_other_data) --> relay_type
}

file network_status_churn_views {
    entity network_status
    entity network_status_document
    ' rectangle hourly_relays_cw_flags
    [hourly_relays_cw_flags] --> network_status
    hourly_relays_cw_flags --> network_status_document
    hourly_relays_cw_flags --> network_status_entry
    (hourly_lost_relays_by_flag) --> hourly_relays_cw_flags
    (hourly_number_relays_by_flag) --> hourly_relays_cw_flags
    [relays_churn_rate] --> hourly_lost_relays_by_flag
    [relays_churn_rate] --> hourly_number_relays_by_flag
    [relays_churn_rate_guard] --> hourly_lost_relays_by_flag
    [relays_churn_rate_guard] --> hourly_number_relays_by_flag
    [relays_churn_rate_exit] --> hourly_lost_relays_by_flag
    [relays_churn_rate_exit] --> hourly_number_relays_by_flag
    [relays_churn_rate_hsdir] --> hourly_lost_relays_by_flag
    [relays_churn_rate_hsdir] --> hourly_number_relays_by_flag
    [relays_churn_rate_stable] --> hourly_lost_relays_by_flag
    [relays_churn_rate_stable] --> hourly_number_relays_by_flag
    [relays_churn_rate_valid] --> hourly_lost_relays_by_flag
    [relays_churn_rate_valid] --> hourly_number_relays_by_flag
    [relays_churn_rate_v2dir] --> hourly_lost_relays_by_flag
    [relays_churn_rate_v2dir] --> hourly_number_relays_by_flag
    (hourly_new_relays_by_flag) --> hourly_relays_cw_flags
    (hourly_start_end_number_relays_by_flag) --> hourly_number_relays_by_flag
    [relays_churn_rate_new] --> hourly_new_relays_by_flag
    [relays_churn_rate_new] --> hourly_start_end_number_relays_by_flag
    [relays_churn_rate_new_guard] --> hourly_new_relays_by_flag
    [relays_churn_rate_new_guard] --> hourly_start_end_number_relays_by_flag
    [relays_churn_rate_new_exit] --> hourly_new_relays_by_flag
    [relays_churn_rate_new_exit] --> hourly_start_end_number_relays_by_flag
    [relays_churn_rate_new_hsdir] --> hourly_new_relays_by_flag
    [relays_churn_rate_new_hsdir] --> hourly_start_end_number_relays_by_flag
    [relays_churn_rate_new_stable] --> hourly_new_relays_by_flag
    [relays_churn_rate_new_stable] --> hourly_start_end_number_relays_by_flag
    [relays_churn_rate_new_valid] --> hourly_new_relays_by_flag
    [relays_churn_rate_new_valid] --> hourly_start_end_number_relays_by_flag
    [relays_churn_rate_new_v2dir] --> hourly_new_relays_by_flag
    [relays_churn_rate_new_v2dir] --> hourly_start_end_number_relays_by_flag
}

file network_status_cw_churn_views {
    (hourly_lost_cw_by_flag) --> hourly_relays_cw_flags
    (hourly_cw_by_flag) --> hourly_relays_cw_flags
    [relays_cw_churn_rate] --> hourly_cw_by_flag
    [relays_cw_churn_rate] --> hourly_lost_cw_by_flag
    [relays_cw_churn_rate_guard] --> hourly_cw_by_flag
    [relays_cw_churn_rate_guard] --> hourly_lost_cw_by_flag
    [relays_cw_churn_rate_exit] --> hourly_cw_by_flag
    [relays_cw_churn_rate_exit] --> hourly_lost_cw_by_flag
    [relays_cw_churn_rate_hsdir] --> hourly_cw_by_flag
    [relays_cw_churn_rate_hsdir] --> hourly_lost_cw_by_flag
    [relays_cw_churn_rate_stable] --> hourly_cw_by_flag
    [relays_cw_churn_rate_stable] --> hourly_lost_cw_by_flag
    [relays_cw_churn_rate_valid] --> hourly_cw_by_flag
    [relays_cw_churn_rate_valid] --> hourly_lost_cw_by_flag
    [relays_cw_churn_rate_v2dir] --> hourly_cw_by_flag
    [relays_cw_churn_rate_v2dir] --> hourly_lost_cw_by_flag
    (hourly_new_cw_by_flag) --> hourly_relays_cw_flags
    (hourly_start_end_cw_by_flag) --> hourly_new_cw_by_flag
    [relays_cw_churn_rate_new] --> hourly_new_cw_by_flag
    [relays_cw_churn_rate_new] --> hourly_start_end_cw_by_flag
    [relays_cw_churn_rate_new_guard] --> hourly_new_cw_by_flag
    [relays_cw_churn_rate_new_guard] --> hourly_start_end_cw_by_flag
    [relays_cw_churn_rate_new_exit] --> hourly_new_cw_by_flag
    [relays_cw_churn_rate_new_exit] --> hourly_start_end_cw_by_flag
    [relays_cw_churn_rate_new_hsdir] --> hourly_new_cw_by_flag
    [relays_cw_churn_rate_new_hsdir] --> hourly_start_end_cw_by_flag
    [relays_cw_churn_rate_new_stable] --> hourly_new_cw_by_flag
    [relays_cw_churn_rate_new_stable] --> hourly_start_end_cw_by_flag
    [relays_cw_churn_rate_new_valid] --> hourly_new_cw_by_flag
    [relays_cw_churn_rate_new_valid] --> hourly_start_end_cw_by_flag
    [relays_cw_churn_rate_new_v2dir] --> hourly_new_cw_by_flag
    [relays_cw_churn_rate_new_v2dir] --> hourly_start_end_cw_by_flag
}

@enduml
