date,type,wmean,wmedian,wiqm,frac,stats
2021-09-17,rend-relayed-cells,-82285714,-82285714,-82285714,0.00005600,1
2021-09-18,rend-relayed-cells,135139237892,138582110681,137967760669,0.12494300,690
2021-09-19,rend-relayed-cells,138341684472,138192571681,138707708510,0.12643100,680
2021-09-20,rend-relayed-cells,131715885346,134126959153,133992901209,0.12761000,698
2021-09-21,rend-relayed-cells,130617536113,130612374458,131055279158,0.13340600,707
2021-09-22,rend-relayed-cells,128470817932,126799576863,127853600289,0.12785200,700
2021-09-23,rend-relayed-cells,126397730104,127023670766,127480794750,0.12783300,708
2021-09-24,rend-relayed-cells,130293937000,129340899983,130128097122,0.13234500,713
2021-09-25,rend-relayed-cells,134313456635,133192079516,134175632944,0.13147900,684
2021-09-26,rend-relayed-cells,133486950625,136252604082,134852945322,0.13308900,722
2021-09-27,rend-relayed-cells,132337504215,135730889727,135046401443,0.13616800,733
2021-09-28,rend-relayed-cells,135777179353,136712720810,137096993456,0.13919600,763
2021-09-29,rend-relayed-cells,132754914426,134760371045,133789507010,0.13221100,821
2021-09-30,rend-relayed-cells,132116372966,133852348993,134110433733,0.14404900,761
2021-10-01,rend-relayed-cells,138927033266,142909816089,143211681090,0.14587600,705
2021-10-02,rend-relayed-cells,166055563090,171920215819,171916205672,0.14568100,722
2021-10-03,rend-relayed-cells,224693735175,233033990198,233622010308,0.13574900,702
2021-10-04,rend-relayed-cells,243016273489,260887893333,259646844739,0.10720400,713
2021-10-05,rend-relayed-cells,167971157582,175303332093,175057665756,0.10620200,720
2021-10-06,rend-relayed-cells,159053842129,166544855280,165504723725,0.11794100,713
2021-10-07,rend-relayed-cells,195011386825,209488631608,208081929936,0.14285400,708
2021-10-08,rend-relayed-cells,215224143198,227828645694,227817281962,0.14742400,719
2021-10-09,rend-relayed-cells,261619553288,278161721573,278355339636,0.15206200,717
2021-10-10,rend-relayed-cells,270809559749,286288874382,285432202769,0.13895300,781
2021-10-11,rend-relayed-cells,276109224619,294326335857,294098170917,0.15496300,831
2021-10-12,rend-relayed-cells,277809517047,293676373588,294038561682,0.15966300,744
2021-10-13,rend-relayed-cells,268320127030,288174665143,287823445827,0.15652800,739
2021-10-14,rend-relayed-cells,278295267033,302297700787,300296412769,0.15792200,724
2021-10-15,rend-relayed-cells,286495526546,311721711847,310487742989,0.16642400,720
2021-10-16,rend-relayed-cells,279077512125,306882806223,306115105605,0.16602800,732
2021-10-17,rend-relayed-cells,276156295723,309415676550,306070752067,0.17561900,743
2021-10-18,rend-relayed-cells,290668531673,322895391196,320262169800,0.16812800,738
2021-10-19,rend-relayed-cells,268050308275,302656688423,302149942974,0.15705600,728
2021-10-20,rend-relayed-cells,289094872339,324757435407,322985137232,0.15827600,705
2021-10-21,rend-relayed-cells,284531043316,316095305035,315713767125,0.14965500,706
2021-10-22,rend-relayed-cells,277152787540,309891247998,308972713731,0.15544900,696
2021-10-23,rend-relayed-cells,276365572981,311790800445,310714830449,0.15425300,702
2021-10-24,rend-relayed-cells,299710531723,341150186925,339680238378,0.15627400,720
2021-10-25,rend-relayed-cells,314317760661,365099221785,360876723865,0.15603000,705
2021-10-26,rend-relayed-cells,318307369062,371271769820,366593555084,0.15854900,710
2021-10-27,rend-relayed-cells,308661151438,364070019070,357619251101,0.15408600,686
2021-09-18,dir-onions-seen,661696,546601,553693,0.13100700,578
2021-09-19,dir-onions-seen,649025,540155,548502,0.13256600,582
2021-09-20,dir-onions-seen,646451,548984,551841,0.13517300,585
2021-09-21,dir-onions-seen,641095,537654,543591,0.13667100,593
2021-09-22,dir-onions-seen,661918,555772,550795,0.13407200,583
2021-09-23,dir-onions-seen,674741,531359,546843,0.13053100,560
2021-09-24,dir-onions-seen,685750,556255,563677,0.13037800,564
2021-09-25,dir-onions-seen,693148,541808,559563,0.12718100,553
2021-09-26,dir-onions-seen,705268,572368,578663,0.11708800,512
2021-09-27,dir-onions-seen,707298,549523,577123,0.12019300,532
2021-09-28,dir-onions-seen,686643,555108,575915,0.12195400,544
2021-09-29,dir-onions-seen,691859,543343,573198,0.12448000,545
2021-09-30,dir-onions-seen,698199,564438,577342,0.13551200,601
2021-10-01,dir-onions-seen,685398,542213,567165,0.14150100,596
2021-10-02,dir-onions-seen,695896,558845,571674,0.14191200,610
2021-10-03,dir-onions-seen,706616,566992,575757,0.14586900,627
2021-10-04,dir-onions-seen,693760,564298,581039,0.14978900,619
2021-10-05,dir-onions-seen,710953,576503,584991,0.15094900,622
2021-10-06,dir-onions-seen,710050,573138,579628,0.15198700,633
2021-10-07,dir-onions-seen,710818,555069,576383,0.15200300,627
2021-10-08,dir-onions-seen,707948,544349,569351,0.15314900,642
2021-10-09,dir-onions-seen,693274,557930,575964,0.15354100,637
2021-10-10,dir-onions-seen,698800,576361,588231,0.15046700,629
2021-10-11,dir-onions-seen,723447,576623,599812,0.15792000,646
2021-10-12,dir-onions-seen,717247,586225,599406,0.16173500,653
2021-10-13,dir-onions-seen,733401,591384,603128,0.16237400,651
2021-10-14,dir-onions-seen,757039,620988,632264,0.16275700,660
2021-10-15,dir-onions-seen,732801,586365,608126,0.16201200,636
2021-10-16,dir-onions-seen,731833,572183,600565,0.16483500,620
2021-10-17,dir-onions-seen,702263,553470,580358,0.16692000,618
2021-10-18,dir-onions-seen,717389,577446,601668,0.16926800,641
2021-10-19,dir-onions-seen,725893,605594,612690,0.17080700,648
2021-10-20,dir-onions-seen,732339,599113,609480,0.16658000,628
2021-10-21,dir-onions-seen,751062,613864,624127,0.16908900,626
2021-10-22,dir-onions-seen,751895,612129,625430,0.17053300,613
2021-10-23,dir-onions-seen,738418,588911,608936,0.16794900,602
2021-10-24,dir-onions-seen,738633,600952,611563,0.17068700,609
2021-10-25,dir-onions-seen,757198,622495,631791,0.16833500,624
2021-10-26,dir-onions-seen,769330,635841,641309,0.16536200,624
2021-10-27,dir-onions-seen,757028,608453,614053,0.16431800,600
