{
  "100": "100 (maximum)",
  "99": "99",
  "98": "98",
  "97": "97",
  "95": "95",
  "91": "91",
  "90": "90",
  "80": "80",
  "75": "75 (3rd quartile)",
  "70": "70",
  "60": "60",
  "50": "50 (median)",
  "40": "40",
  "30": "30",
  "25": "25 (1st quartile)",
  "20": "20",
  "10": "10",
  "9": "9",
  "5": "5",
  "3": "3",
  "2": "2",
  "1": "1",
  "0": "minimum"
}