{
  "$schema": "https://docs.renovatebot.com/renovate-schema.json",
  "extends": ["config:base"],
  "assignees": ["renovate-bot"],
  "reviewers": ["sarthikg"],
  "labels": ["Needs Review"],
  "ignoreDeps": ["python"]
}
