{
    "__elements": {},
    "__inputs": [
        {
            "description": "",
            "label": "grafana-postgresql-datasource",
            "name": "DS_GRAFANA-POSTGRESQL-DATASOURCE",
            "pluginId": "postgres",
            "pluginName": "PostgreSQL",
            "type": "datasource"
        }
    ],
    "__requires": [
        {
            "id": "grafana",
            "name": "Grafana",
            "type": "grafana",
            "version": "10.1.4"
        },
        {
            "id": "postgres",
            "name": "PostgreSQL",
            "type": "datasource",
            "version": "1.0.0"
        },
        {
            "id": "stat",
            "name": "Stat",
            "type": "panel",
            "version": ""
        },
        {
            "id": "timeseries",
            "name": "Time series",
            "type": "panel",
            "version": ""
        }
    ],
    "annotations": {
        "list": [
            {
                "builtIn": 1,
                "datasource": {
                    "type": "grafana",
                    "uid": "-- Grafana --"
                },
                "enable": true,
                "hide": true,
                "iconColor": "rgba(0, 211, 255, 1)",
                "name": "Annotations & Alerts",
                "type": "dashboard"
            }
        ]
    },
    "description": "",
    "editable": true,
    "fiscalYearStartMonth": 0,
    "graphTooltip": 0,
    "id": 120,
    "links": [],
    "liveNow": false,
    "panels": [
        {
            "datasource": {
                "type": "postgres",
                "uid": "d12b75ef-cb05-4c67-a6c5-f0ae3665fb5f"
            },
            "fieldConfig": {
                "defaults": {
                    "color": {
                        "mode": "thresholds"
                    },
                    "mappings": [],
                    "thresholds": {
                        "mode": "absolute",
                        "steps": [
                            {
                                "color": "green",
                                "value": null
                            },
                            {
                                "color": "red",
                                "value": 80
                            }
                        ]
                    },
                    "unit": "none"
                },
                "overrides": []
            },
            "gridPos": {
                "h": 7,
                "w": 12,
                "x": 0,
                "y": 0
            },
            "hideTimeOverride": false,
            "id": 1,
            "links": [],
            "maxDataPoints": 100,
            "options": {
                "colorMode": "none",
                "graphMode": "none",
                "justifyMode": "auto",
                "orientation": "horizontal",
                "reduceOptions": {
                    "calcs": [
                        "mean"
                    ],
                    "fields": "",
                    "values": false
                },
                "textMode": "auto"
            },
            "pluginVersion": "10.1.4",
            "targets": [
                {
                    "datasource": {
                        "type": "postgres",
                        "uid": "d12b75ef-cb05-4c67-a6c5-f0ae3665fb5f"
                    },
                    "expr": "",
                    "format": "table",
                    "hide": false,
                    "instant": false,
                    "interval": "",
                    "intervalFactor": 2,
                    "legendFormat": "",
                    "metric": "",
                    "query": "",
                    "rawQuery": true,
                    "rawSql": "SELECT PERCENTILE_CONT(0.5)\nWITHIN GROUP(ORDER BY cw_churn_lost) as median_cw_churn_lost\nFROM relays_cw_churn_rate\nwhere $__timeFilter(end_hour)",
                    "refId": "A",
                    "step": 10,
                    "target": ""
                }
            ],
            "title": "Relays Consensus Weight Churn Rate (lost) Median",
            "transformations": [],
            "type": "stat"
        },
        {
            "datasource": {
                "type": "postgres",
                "uid": "d12b75ef-cb05-4c67-a6c5-f0ae3665fb5f"
            },
            "fieldConfig": {
                "defaults": {
                    "color": {
                        "mode": "thresholds"
                    },
                    "mappings": [],
                    "thresholds": {
                        "mode": "absolute",
                        "steps": [
                            {
                                "color": "green",
                                "value": null
                            },
                            {
                                "color": "red",
                                "value": 80
                            }
                        ]
                    },
                    "unit": "none"
                },
                "overrides": []
            },
            "gridPos": {
                "h": 7,
                "w": 12,
                "x": 12,
                "y": 0
            },
            "hideTimeOverride": false,
            "id": 2,
            "links": [],
            "maxDataPoints": 100,
            "options": {
                "colorMode": "none",
                "graphMode": "none",
                "justifyMode": "auto",
                "orientation": "horizontal",
                "reduceOptions": {
                    "calcs": [
                        "mean"
                    ],
                    "fields": "",
                    "values": false
                },
                "textMode": "auto"
            },
            "pluginVersion": "10.1.4",
            "targets": [
                {
                    "datasource": {
                        "type": "postgres",
                        "uid": "d12b75ef-cb05-4c67-a6c5-f0ae3665fb5f"
                    },
                    "expr": "",
                    "format": "table",
                    "hide": false,
                    "instant": false,
                    "interval": "",
                    "intervalFactor": 2,
                    "legendFormat": "",
                    "metric": "",
                    "query": "",
                    "rawQuery": true,
                    "rawSql": "SELECT PERCENTILE_CONT(0.5)\nWITHIN GROUP(ORDER BY cw_churn_new) as median_cw_churn_new\nFROM relays_cw_churn_rate_new\nwhere $__timeFilter(end_hour)",
                    "refId": "A",
                    "step": 10,
                    "target": ""
                }
            ],
            "title": "Relays Consensus Weight Churn Rate (new) Median",
            "transformations": [],
            "type": "stat"
        },
        {
            "datasource": {
                "type": "postgres",
                "uid": "d12b75ef-cb05-4c67-a6c5-f0ae3665fb5f"
            },
            "editable": true,
            "error": false,
            "fieldConfig": {
                "defaults": {
                    "color": {
                        "mode": "palette-classic"
                    },
                    "custom": {
                        "axisCenteredZero": false,
                        "axisColorMode": "text",
                        "axisLabel": "",
                        "axisPlacement": "auto",
                        "barAlignment": 0,
                        "drawStyle": "line",
                        "fillOpacity": 10,
                        "gradientMode": "none",
                        "hideFrom": {
                            "legend": false,
                            "tooltip": false,
                            "viz": false
                        },
                        "insertNulls": false,
                        "lineInterpolation": "linear",
                        "lineWidth": 1,
                        "pointSize": 5,
                        "scaleDistribution": {
                            "log": 2,
                            "type": "linear"
                        },
                        "showPoints": "Always",
                        "spanNulls": true,
                        "stacking": {
                            "group": "A",
                            "mode": "none"
                        },
                        "thresholdsStyle": {
                            "mode": "off"
                        }
                    },
                    "mappings": [],
                    "thresholds": {
                        "mode": "absolute",
                        "steps": []
                    },
                    "unit": ""
                },
                "overrides": []
            },
            "gridPos": {
                "h": 7,
                "w": 24,
                "x": 0,
                "y": 7
            },
            "hideTimeOverride": false,
            "id": 3,
            "links": [],
            "maxDataPoints": 100,
            "options": {
                "legend": {
                    "calcs": [],
                    "displayMode": "list",
                    "placement": "bottom",
                    "showLegend": true
                },
                "tooltip": {
                    "mode": "single",
                    "sort": "none"
                }
            },
            "targets": [
                {
                    "datasource": {
                        "type": "postgres",
                        "uid": "d12b75ef-cb05-4c67-a6c5-f0ae3665fb5f"
                    },
                    "expr": "",
                    "format": "table",
                    "hide": false,
                    "instant": false,
                    "interval": "",
                    "intervalFactor": 2,
                    "legendFormat": "",
                    "metric": "",
                    "query": "",
                    "rawQuery": true,
                    "rawSql": "SELECT end_hour, -cw_churn_lost AS cw_churn_lost_negative\nFROM relays_cw_churn_rate\nWHERE $__timeFilter(end_hour)\nand cw_churn_lost < 1",
                    "refId": "A",
                    "step": 10,
                    "target": ""
                },
                {
                    "datasource": {
                        "type": "postgres",
                        "uid": "d12b75ef-cb05-4c67-a6c5-f0ae3665fb5f"
                    },
                    "expr": "",
                    "format": "table",
                    "hide": false,
                    "instant": false,
                    "interval": "",
                    "intervalFactor": 2,
                    "legendFormat": "",
                    "metric": "",
                    "query": "",
                    "rawQuery": true,
                    "rawSql": "SELECT end_hour, cw_churn_new\nFROM relays_cw_churn_rate_new\nWHERE $__timeFilter(end_hour)",
                    "refId": "B",
                    "step": 10,
                    "target": ""
                }
            ],
            "title": "relays_cw_churn_rate",
            "transformations": [],
            "type": "timeseries"
        },
        {
            "datasource": {
                "type": "postgres",
                "uid": "d12b75ef-cb05-4c67-a6c5-f0ae3665fb5f"
            },
            "editable": true,
            "error": false,
            "fieldConfig": {
                "defaults": {
                    "color": {
                        "mode": "palette-classic"
                    },
                    "custom": {
                        "axisCenteredZero": false,
                        "axisColorMode": "text",
                        "axisLabel": "",
                        "axisPlacement": "auto",
                        "barAlignment": 0,
                        "drawStyle": "line",
                        "fillOpacity": 10,
                        "gradientMode": "none",
                        "hideFrom": {
                            "legend": false,
                            "tooltip": false,
                            "viz": false
                        },
                        "insertNulls": false,
                        "lineInterpolation": "linear",
                        "lineWidth": 1,
                        "pointSize": 5,
                        "scaleDistribution": {
                            "log": 2,
                            "type": "linear"
                        },
                        "showPoints": "Always",
                        "spanNulls": true,
                        "stacking": {
                            "group": "A",
                            "mode": "none"
                        },
                        "thresholdsStyle": {
                            "mode": "off"
                        }
                    },
                    "mappings": [],
                    "thresholds": {
                        "mode": "absolute",
                        "steps": []
                    },
                    "unit": ""
                },
                "overrides": []
            },
            "gridPos": {
                "h": 7,
                "w": 24,
                "x": 0,
                "y": 14
            },
            "hideTimeOverride": false,
            "id": 4,
            "links": [],
            "maxDataPoints": 100,
            "options": {
                "legend": {
                    "calcs": [],
                    "displayMode": "list",
                    "placement": "bottom",
                    "showLegend": true
                },
                "tooltip": {
                    "mode": "single",
                    "sort": "none"
                }
            },
            "targets": [
                {
                    "datasource": {
                        "type": "postgres",
                        "uid": "d12b75ef-cb05-4c67-a6c5-f0ae3665fb5f"
                    },
                    "expr": "",
                    "format": "table",
                    "hide": false,
                    "instant": false,
                    "interval": "",
                    "intervalFactor": 2,
                    "legendFormat": "",
                    "metric": "",
                    "query": "",
                    "rawQuery": true,
                    "rawSql": "SELECT end_hour, -cw_churn_lost AS cw_churn_lost_negative\nFROM relays_cw_churn_rate_Guard\nWHERE $__timeFilter(end_hour)\nand cw_churn_lost < 1",
                    "refId": "A",
                    "step": 10,
                    "target": ""
                },
                {
                    "datasource": {
                        "type": "postgres",
                        "uid": "d12b75ef-cb05-4c67-a6c5-f0ae3665fb5f"
                    },
                    "expr": "",
                    "format": "table",
                    "hide": false,
                    "instant": false,
                    "interval": "",
                    "intervalFactor": 2,
                    "legendFormat": "",
                    "metric": "",
                    "query": "",
                    "rawQuery": true,
                    "rawSql": "SELECT end_hour, cw_churn_new\nFROM relays_cw_churn_rate_new_Guard\nWHERE $__timeFilter(end_hour)",
                    "refId": "B",
                    "step": 10,
                    "target": ""
                }
            ],
            "title": "relays_cw_churn_rate_Guard",
            "transformations": [],
            "type": "timeseries"
        },
        {
            "datasource": {
                "type": "postgres",
                "uid": "d12b75ef-cb05-4c67-a6c5-f0ae3665fb5f"
            },
            "editable": true,
            "error": false,
            "fieldConfig": {
                "defaults": {
                    "color": {
                        "mode": "palette-classic"
                    },
                    "custom": {
                        "axisCenteredZero": false,
                        "axisColorMode": "text",
                        "axisLabel": "",
                        "axisPlacement": "auto",
                        "barAlignment": 0,
                        "drawStyle": "line",
                        "fillOpacity": 10,
                        "gradientMode": "none",
                        "hideFrom": {
                            "legend": false,
                            "tooltip": false,
                            "viz": false
                        },
                        "insertNulls": false,
                        "lineInterpolation": "linear",
                        "lineWidth": 1,
                        "pointSize": 5,
                        "scaleDistribution": {
                            "log": 2,
                            "type": "linear"
                        },
                        "showPoints": "Always",
                        "spanNulls": true,
                        "stacking": {
                            "group": "A",
                            "mode": "none"
                        },
                        "thresholdsStyle": {
                            "mode": "off"
                        }
                    },
                    "mappings": [],
                    "thresholds": {
                        "mode": "absolute",
                        "steps": []
                    },
                    "unit": ""
                },
                "overrides": []
            },
            "gridPos": {
                "h": 7,
                "w": 24,
                "x": 0,
                "y": 21
            },
            "hideTimeOverride": false,
            "id": 5,
            "links": [],
            "maxDataPoints": 100,
            "options": {
                "legend": {
                    "calcs": [],
                    "displayMode": "list",
                    "placement": "bottom",
                    "showLegend": true
                },
                "tooltip": {
                    "mode": "single",
                    "sort": "none"
                }
            },
            "targets": [
                {
                    "datasource": {
                        "type": "postgres",
                        "uid": "d12b75ef-cb05-4c67-a6c5-f0ae3665fb5f"
                    },
                    "expr": "",
                    "format": "table",
                    "hide": false,
                    "instant": false,
                    "interval": "",
                    "intervalFactor": 2,
                    "legendFormat": "",
                    "metric": "",
                    "query": "",
                    "rawQuery": true,
                    "rawSql": "SELECT end_hour, -cw_churn_lost AS cw_churn_lost_negative\nFROM relays_cw_churn_rate_Exit\nWHERE $__timeFilter(end_hour)\nand cw_churn_lost < 1",
                    "refId": "A",
                    "step": 10,
                    "target": ""
                },
                {
                    "datasource": {
                        "type": "postgres",
                        "uid": "d12b75ef-cb05-4c67-a6c5-f0ae3665fb5f"
                    },
                    "expr": "",
                    "format": "table",
                    "hide": false,
                    "instant": false,
                    "interval": "",
                    "intervalFactor": 2,
                    "legendFormat": "",
                    "metric": "",
                    "query": "",
                    "rawQuery": true,
                    "rawSql": "SELECT end_hour, cw_churn_new\nFROM relays_cw_churn_rate_new_Exit\nWHERE $__timeFilter(end_hour)",
                    "refId": "B",
                    "step": 10,
                    "target": ""
                }
            ],
            "title": "relays_cw_churn_rate_Exit",
            "transformations": [],
            "type": "timeseries"
        },
        {
            "datasource": {
                "type": "postgres",
                "uid": "d12b75ef-cb05-4c67-a6c5-f0ae3665fb5f"
            },
            "editable": true,
            "error": false,
            "fieldConfig": {
                "defaults": {
                    "color": {
                        "mode": "palette-classic"
                    },
                    "custom": {
                        "axisCenteredZero": false,
                        "axisColorMode": "text",
                        "axisLabel": "",
                        "axisPlacement": "auto",
                        "barAlignment": 0,
                        "drawStyle": "line",
                        "fillOpacity": 10,
                        "gradientMode": "none",
                        "hideFrom": {
                            "legend": false,
                            "tooltip": false,
                            "viz": false
                        },
                        "insertNulls": false,
                        "lineInterpolation": "linear",
                        "lineWidth": 1,
                        "pointSize": 5,
                        "scaleDistribution": {
                            "log": 2,
                            "type": "linear"
                        },
                        "showPoints": "Always",
                        "spanNulls": true,
                        "stacking": {
                            "group": "A",
                            "mode": "none"
                        },
                        "thresholdsStyle": {
                            "mode": "off"
                        }
                    },
                    "mappings": [],
                    "thresholds": {
                        "mode": "absolute",
                        "steps": []
                    },
                    "unit": ""
                },
                "overrides": []
            },
            "gridPos": {
                "h": 7,
                "w": 24,
                "x": 0,
                "y": 28
            },
            "hideTimeOverride": false,
            "id": 6,
            "links": [],
            "maxDataPoints": 100,
            "options": {
                "legend": {
                    "calcs": [],
                    "displayMode": "list",
                    "placement": "bottom",
                    "showLegend": true
                },
                "tooltip": {
                    "mode": "single",
                    "sort": "none"
                }
            },
            "targets": [
                {
                    "datasource": {
                        "type": "postgres",
                        "uid": "d12b75ef-cb05-4c67-a6c5-f0ae3665fb5f"
                    },
                    "expr": "",
                    "format": "table",
                    "hide": false,
                    "instant": false,
                    "interval": "",
                    "intervalFactor": 2,
                    "legendFormat": "",
                    "metric": "",
                    "query": "",
                    "rawQuery": true,
                    "rawSql": "SELECT end_hour, -cw_churn_lost AS cw_churn_lost_negative\nFROM relays_cw_churn_rate_HSDir\nWHERE $__timeFilter(end_hour)\nand cw_churn_lost < 1",
                    "refId": "A",
                    "step": 10,
                    "target": ""
                },
                {
                    "datasource": {
                        "type": "postgres",
                        "uid": "d12b75ef-cb05-4c67-a6c5-f0ae3665fb5f"
                    },
                    "expr": "",
                    "format": "table",
                    "hide": false,
                    "instant": false,
                    "interval": "",
                    "intervalFactor": 2,
                    "legendFormat": "",
                    "metric": "",
                    "query": "",
                    "rawQuery": true,
                    "rawSql": "SELECT end_hour, cw_churn_new\nFROM relays_cw_churn_rate_new_HSDir\nWHERE $__timeFilter(end_hour)",
                    "refId": "B",
                    "step": 10,
                    "target": ""
                }
            ],
            "title": "relays_cw_churn_rate_HSDir",
            "transformations": [],
            "type": "timeseries"
        },
        {
            "datasource": {
                "type": "postgres",
                "uid": "d12b75ef-cb05-4c67-a6c5-f0ae3665fb5f"
            },
            "editable": true,
            "error": false,
            "fieldConfig": {
                "defaults": {
                    "color": {
                        "mode": "palette-classic"
                    },
                    "custom": {
                        "axisCenteredZero": false,
                        "axisColorMode": "text",
                        "axisLabel": "",
                        "axisPlacement": "auto",
                        "barAlignment": 0,
                        "drawStyle": "line",
                        "fillOpacity": 10,
                        "gradientMode": "none",
                        "hideFrom": {
                            "legend": false,
                            "tooltip": false,
                            "viz": false
                        },
                        "insertNulls": false,
                        "lineInterpolation": "linear",
                        "lineWidth": 1,
                        "pointSize": 5,
                        "scaleDistribution": {
                            "log": 2,
                            "type": "linear"
                        },
                        "showPoints": "Always",
                        "spanNulls": true,
                        "stacking": {
                            "group": "A",
                            "mode": "none"
                        },
                        "thresholdsStyle": {
                            "mode": "off"
                        }
                    },
                    "mappings": [],
                    "thresholds": {
                        "mode": "absolute",
                        "steps": []
                    },
                    "unit": ""
                },
                "overrides": []
            },
            "gridPos": {
                "h": 7,
                "w": 24,
                "x": 0,
                "y": 35
            },
            "hideTimeOverride": false,
            "id": 7,
            "links": [],
            "maxDataPoints": 100,
            "options": {
                "legend": {
                    "calcs": [],
                    "displayMode": "list",
                    "placement": "bottom",
                    "showLegend": true
                },
                "tooltip": {
                    "mode": "single",
                    "sort": "none"
                }
            },
            "targets": [
                {
                    "datasource": {
                        "type": "postgres",
                        "uid": "d12b75ef-cb05-4c67-a6c5-f0ae3665fb5f"
                    },
                    "expr": "",
                    "format": "table",
                    "hide": false,
                    "instant": false,
                    "interval": "",
                    "intervalFactor": 2,
                    "legendFormat": "",
                    "metric": "",
                    "query": "",
                    "rawQuery": true,
                    "rawSql": "SELECT end_hour, -cw_churn_lost AS cw_churn_lost_negative\nFROM relays_cw_churn_rate_Stable\nWHERE $__timeFilter(end_hour)\nand cw_churn_lost < 1",
                    "refId": "A",
                    "step": 10,
                    "target": ""
                },
                {
                    "datasource": {
                        "type": "postgres",
                        "uid": "d12b75ef-cb05-4c67-a6c5-f0ae3665fb5f"
                    },
                    "expr": "",
                    "format": "table",
                    "hide": false,
                    "instant": false,
                    "interval": "",
                    "intervalFactor": 2,
                    "legendFormat": "",
                    "metric": "",
                    "query": "",
                    "rawQuery": true,
                    "rawSql": "SELECT end_hour, cw_churn_new\nFROM relays_cw_churn_rate_new_Stable\nWHERE $__timeFilter(end_hour)",
                    "refId": "B",
                    "step": 10,
                    "target": ""
                }
            ],
            "title": "relays_cw_churn_rate_Stable",
            "transformations": [],
            "type": "timeseries"
        },
        {
            "datasource": {
                "type": "postgres",
                "uid": "d12b75ef-cb05-4c67-a6c5-f0ae3665fb5f"
            },
            "editable": true,
            "error": false,
            "fieldConfig": {
                "defaults": {
                    "color": {
                        "mode": "palette-classic"
                    },
                    "custom": {
                        "axisCenteredZero": false,
                        "axisColorMode": "text",
                        "axisLabel": "",
                        "axisPlacement": "auto",
                        "barAlignment": 0,
                        "drawStyle": "line",
                        "fillOpacity": 10,
                        "gradientMode": "none",
                        "hideFrom": {
                            "legend": false,
                            "tooltip": false,
                            "viz": false
                        },
                        "insertNulls": false,
                        "lineInterpolation": "linear",
                        "lineWidth": 1,
                        "pointSize": 5,
                        "scaleDistribution": {
                            "log": 2,
                            "type": "linear"
                        },
                        "showPoints": "Always",
                        "spanNulls": true,
                        "stacking": {
                            "group": "A",
                            "mode": "none"
                        },
                        "thresholdsStyle": {
                            "mode": "off"
                        }
                    },
                    "mappings": [],
                    "thresholds": {
                        "mode": "absolute",
                        "steps": []
                    },
                    "unit": ""
                },
                "overrides": []
            },
            "gridPos": {
                "h": 7,
                "w": 24,
                "x": 0,
                "y": 42
            },
            "hideTimeOverride": false,
            "id": 8,
            "links": [],
            "maxDataPoints": 100,
            "options": {
                "legend": {
                    "calcs": [],
                    "displayMode": "list",
                    "placement": "bottom",
                    "showLegend": true
                },
                "tooltip": {
                    "mode": "single",
                    "sort": "none"
                }
            },
            "targets": [
                {
                    "datasource": {
                        "type": "postgres",
                        "uid": "d12b75ef-cb05-4c67-a6c5-f0ae3665fb5f"
                    },
                    "expr": "",
                    "format": "table",
                    "hide": false,
                    "instant": false,
                    "interval": "",
                    "intervalFactor": 2,
                    "legendFormat": "",
                    "metric": "",
                    "query": "",
                    "rawQuery": true,
                    "rawSql": "SELECT end_hour, -cw_churn_lost AS cw_churn_lost_negative\nFROM relays_cw_churn_rate_Valid\nWHERE $__timeFilter(end_hour)\nand cw_churn_lost < 1",
                    "refId": "A",
                    "step": 10,
                    "target": ""
                },
                {
                    "datasource": {
                        "type": "postgres",
                        "uid": "d12b75ef-cb05-4c67-a6c5-f0ae3665fb5f"
                    },
                    "expr": "",
                    "format": "table",
                    "hide": false,
                    "instant": false,
                    "interval": "",
                    "intervalFactor": 2,
                    "legendFormat": "",
                    "metric": "",
                    "query": "",
                    "rawQuery": true,
                    "rawSql": "SELECT end_hour, cw_churn_new\nFROM relays_cw_churn_rate_new_Valid\nWHERE $__timeFilter(end_hour)",
                    "refId": "B",
                    "step": 10,
                    "target": ""
                }
            ],
            "title": "relays_cw_churn_rate_Valid",
            "transformations": [],
            "type": "timeseries"
        },
        {
            "datasource": {
                "type": "postgres",
                "uid": "d12b75ef-cb05-4c67-a6c5-f0ae3665fb5f"
            },
            "editable": true,
            "error": false,
            "fieldConfig": {
                "defaults": {
                    "color": {
                        "mode": "palette-classic"
                    },
                    "custom": {
                        "axisCenteredZero": false,
                        "axisColorMode": "text",
                        "axisLabel": "",
                        "axisPlacement": "auto",
                        "barAlignment": 0,
                        "drawStyle": "line",
                        "fillOpacity": 10,
                        "gradientMode": "none",
                        "hideFrom": {
                            "legend": false,
                            "tooltip": false,
                            "viz": false
                        },
                        "insertNulls": false,
                        "lineInterpolation": "linear",
                        "lineWidth": 1,
                        "pointSize": 5,
                        "scaleDistribution": {
                            "log": 2,
                            "type": "linear"
                        },
                        "showPoints": "Always",
                        "spanNulls": true,
                        "stacking": {
                            "group": "A",
                            "mode": "none"
                        },
                        "thresholdsStyle": {
                            "mode": "off"
                        }
                    },
                    "mappings": [],
                    "thresholds": {
                        "mode": "absolute",
                        "steps": []
                    },
                    "unit": ""
                },
                "overrides": []
            },
            "gridPos": {
                "h": 7,
                "w": 24,
                "x": 0,
                "y": 49
            },
            "hideTimeOverride": false,
            "id": 9,
            "links": [],
            "maxDataPoints": 100,
            "options": {
                "legend": {
                    "calcs": [],
                    "displayMode": "list",
                    "placement": "bottom",
                    "showLegend": true
                },
                "tooltip": {
                    "mode": "single",
                    "sort": "none"
                }
            },
            "targets": [
                {
                    "datasource": {
                        "type": "postgres",
                        "uid": "d12b75ef-cb05-4c67-a6c5-f0ae3665fb5f"
                    },
                    "expr": "",
                    "format": "table",
                    "hide": false,
                    "instant": false,
                    "interval": "",
                    "intervalFactor": 2,
                    "legendFormat": "",
                    "metric": "",
                    "query": "",
                    "rawQuery": true,
                    "rawSql": "SELECT end_hour, -cw_churn_lost AS cw_churn_lost_negative\nFROM relays_cw_churn_rate_V2Dir\nWHERE $__timeFilter(end_hour)\nand cw_churn_lost < 1",
                    "refId": "A",
                    "step": 10,
                    "target": ""
                },
                {
                    "datasource": {
                        "type": "postgres",
                        "uid": "d12b75ef-cb05-4c67-a6c5-f0ae3665fb5f"
                    },
                    "expr": "",
                    "format": "table",
                    "hide": false,
                    "instant": false,
                    "interval": "",
                    "intervalFactor": 2,
                    "legendFormat": "",
                    "metric": "",
                    "query": "",
                    "rawQuery": true,
                    "rawSql": "SELECT end_hour, cw_churn_new\nFROM relays_cw_churn_rate_new_V2Dir\nWHERE $__timeFilter(end_hour)",
                    "refId": "B",
                    "step": 10,
                    "target": ""
                }
            ],
            "title": "relays_cw_churn_rate_V2Dir",
            "transformations": [],
            "type": "timeseries"
        }
    ],
    "refresh": "1d",
    "schemaVersion": 38,
    "style": "dark",
    "tags": [
        "provisioned"
    ],
    "templating": {
        "list": []
    },
    "time": {
        "from": "now-60d",
        "to": "now"
    },
    "timepicker": {
        "hidden": false,
        "refresh_intervals": [
            "5s",
            "10s",
            "30s",
            "1m",
            "5m",
            "15m",
            "30m",
            "1h",
            "2h",
            "1d"
        ],
        "time_options": [
            "5m",
            "15m",
            "1h",
            "6h",
            "12h",
            "24h",
            "2d",
            "7d",
            "30d"
        ]
    },
    "timezone": "utc",
    "title": "Relays consensus weight churn lost and new",
    "uid": "relays-cw-churn-lost-new",
    "version": 3,
    "weekStart": ""
}