month,queue,newtickets
2013-10,ar,4
2013-10,en,705
2013-10,es,17
2013-10,fa,27
2013-10,fr,13
2013-10,zh,8
2013-11,ar,9
2013-11,en,680
2013-11,es,24
2013-11,fa,21
2013-11,fr,47
2013-11,zh,12
2013-12,ar,13
2013-12,en,870
2013-12,es,28
2013-12,fa,127
2013-12,fr,38
2013-12,zh,13
