month,fromhours,tohours,requests
2014-04,0,1,258
2014-04,1,2,129
2014-04,2,3,89
2014-04,3,4,85
2014-04,4,5,77
2014-04,5,6,67
2014-04,6,7,71
2014-04,7,8,54
2014-04,8,9,59
2014-04,9,10,62
2014-04,10,11,58
2014-04,11,12,52
2014-04,12,13,62
2014-04,13,14,65
2014-04,14,15,41
2014-04,15,16,44
2014-04,16,17,42
2014-04,17,18,51
2014-04,18,19,36
2014-04,19,20,36
2014-04,20,21,34
2014-04,21,22,43
2014-04,22,23,24
2014-04,23,24,25
2014-04,24,25,19
2014-04,25,26,21
2014-04,26,27,25
2014-04,27,28,14
2014-04,28,29,17
2014-04,29,30,16
2014-04,30,31,25
2014-04,31,32,16
2014-04,32,33,16
2014-04,33,34,26
2014-04,34,35,13
2014-04,35,36,10
2014-04,36,37,19
2014-04,37,38,15
2014-04,38,39,13
2014-04,39,40,15
2014-04,40,41,15
2014-04,41,42,9
2014-04,42,43,18
2014-04,43,44,14
2014-04,44,45,12
2014-04,45,46,11
2014-04,46,47,9
2014-04,47,48,9
2014-04,48,49,13
2014-04,49,50,6
2014-04,50,51,14
2014-04,51,52,7
2014-04,52,53,9
2014-04,53,54,13
2014-04,54,55,5
2014-04,55,56,9
2014-04,56,57,9
2014-04,57,58,10
2014-04,58,59,8
2014-04,59,60,3
2014-04,60,61,2
2014-04,61,62,8
2014-04,62,63,8
2014-04,63,64,10
2014-04,64,65,3
2014-04,65,66,4
2014-04,66,67,9
2014-04,67,68,10
2014-04,68,69,4
2014-04,69,70,4
2014-04,70,71,8
2014-04,71,72,8
2014-04,72,73,7
2014-04,73,74,6
2014-04,74,75,2
2014-04,75,76,5
2014-04,76,77,3
2014-04,77,78,2
2014-04,78,79,2
2014-04,79,80,8
2014-04,80,81,1
2014-04,81,82,3
2014-04,82,83,4
2014-04,83,84,3
2014-04,84,85,2
2014-04,85,86,2
2014-04,86,87,2
2014-04,87,88,2
2014-04,88,89,3
2014-04,89,90,4
2014-04,90,91,2
2014-04,91,92,2
2014-04,92,93,1
2014-04,93,94,3
2014-04,94,95,2
2014-04,95,96,4
2014-04,96,97,2
2014-04,97,98,3
2014-04,98,99,2
2014-04,99,100,2
2014-04,100,101,1
2014-04,101,102,1
2014-04,102,103,3
2014-04,103,104,2
2014-04,104,105,2
2014-04,105,106,1
2014-04,106,107,2
2014-04,107,108,1
2014-04,108,109,2
2014-04,111,112,3
2014-04,112,113,1
2014-04,113,114,6
2014-04,114,115,4
2014-04,115,116,3
2014-04,116,117,3
2014-04,117,118,1
2014-04,118,119,7
2014-04,119,120,3
2014-04,122,123,2
2014-04,125,126,2
2014-04,128,129,1
2014-04,129,130,5
2014-04,131,132,2
2014-04,133,134,1
2014-04,134,135,1
2014-04,137,138,1
2014-04,138,139,3
2014-04,139,140,1
2014-04,140,141,1
2014-04,142,143,1
2014-04,143,144,2
2014-04,144,145,2
2014-04,145,146,1
2014-04,146,147,2
2014-04,147,148,1
2014-04,150,151,2
2014-04,151,152,1
2014-04,152,153,2
2014-04,155,156,1
2014-04,157,158,1
2014-04,159,160,1
2014-04,162,163,1
2014-04,163,164,1
2014-04,164,165,1
2014-04,165,166,1
2014-04,168,169,1
2014-04,175,176,1
2014-04,179,180,1
2014-04,184,185,1
2014-04,185,186,1
2014-04,187,188,1
2014-04,188,189,1
2014-04,191,192,2
2014-04,200,201,2
2014-04,201,202,1
2014-04,220,221,1
2014-04,240,241,1
2014-04,246,247,1
2014-04,270,271,1
2014-04,275,276,1
2014-04,310,311,1
2014-04,338,339,1
2014-04,345,346,1
2014-04,348,349,1
2014-04,354,355,1
2014-04,368,369,1
2014-04,370,371,1
2014-04,371,372,1
2014-04,372,373,1
2014-04,373,374,1
2014-04,374,375,2
2014-04,383,384,1
2014-04,386,387,1
2014-04,393,394,1
2014-04,395,396,1
2014-04,396,397,1
2014-04,407,408,3
2014-04,408,409,1
2014-04,411,412,1
2014-04,412,413,1
2014-04,414,415,1
2014-04,419,420,1
2014-04,428,429,1
2014-04,437,438,1
2014-04,443,444,1
2014-04,444,445,1
2014-04,447,448,1
2014-04,453,454,1
2014-04,459,460,1
2014-04,474,475,2
2014-04,481,482,1
2014-04,487,488,1
2014-04,490,491,1
2014-04,494,495,1
2014-04,495,496,1
2014-04,497,498,1
2014-04,499,500,2
2014-04,503,504,1
2014-04,507,508,1
2014-04,523,524,1
2014-04,526,527,1
2014-04,528,529,2
2014-04,529,530,1
2014-04,535,536,1
2014-04,537,538,1
2014-04,547,548,1
2014-04,553,554,1
2014-04,563,564,1
2014-04,564,565,1
2014-04,565,566,1
2014-04,574,575,1
2014-04,580,581,2
2014-04,598,599,1
2014-04,616,617,1
2014-04,625,626,1
2014-04,654,655,2
2014-04,760,761,1
2014-04,792,793,1
2014-04,850,851,1
2014-04,898,899,1
2014-04,919,920,1
2014-04,1099,1100,1
2014-04,1677,1678,1
2014-04,2050,2051,1
2014-04,2312,2313,1
2014-04,5579,5580,1
2014-05,0,1,361
2014-05,1,2,136
2014-05,2,3,122
2014-05,3,4,92
2014-05,4,5,108
2014-05,5,6,79
2014-05,6,7,71
2014-05,7,8,56
2014-05,8,9,54
2014-05,9,10,53
2014-05,10,11,62
2014-05,11,12,41
2014-05,12,13,59
2014-05,13,14,46
2014-05,14,15,47
2014-05,15,16,55
2014-05,16,17,45
2014-05,17,18,46
2014-05,18,19,36
2014-05,19,20,29
2014-05,20,21,23
2014-05,21,22,26
2014-05,22,23,26
2014-05,23,24,32
2014-05,24,25,20
2014-05,25,26,16
2014-05,26,27,9
2014-05,27,28,9
2014-05,28,29,13
2014-05,29,30,20
2014-05,30,31,16
2014-05,31,32,8
2014-05,32,33,16
2014-05,33,34,14
2014-05,34,35,13
2014-05,35,36,13
2014-05,36,37,16
2014-05,37,38,10
2014-05,38,39,10
2014-05,39,40,8
2014-05,40,41,8
2014-05,41,42,7
2014-05,42,43,6
2014-05,43,44,9
2014-05,44,45,2
2014-05,45,46,6
2014-05,46,47,14
2014-05,47,48,10
2014-05,48,49,11
2014-05,49,50,3
2014-05,50,51,9
2014-05,51,52,3
2014-05,52,53,5
2014-05,53,54,5
2014-05,54,55,3
2014-05,55,56,4
2014-05,56,57,5
2014-05,57,58,4
2014-05,58,59,5
2014-05,59,60,6
2014-05,60,61,1
2014-05,61,62,2
2014-05,63,64,3
2014-05,64,65,2
2014-05,65,66,1
2014-05,66,67,4
2014-05,67,68,2
2014-05,68,69,3
2014-05,69,70,1
2014-05,70,71,5
2014-05,71,72,2
2014-05,72,73,6
2014-05,73,74,3
2014-05,74,75,3
2014-05,75,76,7
2014-05,76,77,5
2014-05,77,78,2
2014-05,79,80,3
2014-05,80,81,1
2014-05,81,82,3
2014-05,83,84,1
2014-05,84,85,3
2014-05,88,89,1
2014-05,90,91,1
2014-05,94,95,1
2014-05,95,96,2
2014-05,97,98,2
2014-05,98,99,1
2014-05,99,100,1
2014-05,101,102,2
2014-05,103,104,3
2014-05,104,105,1
2014-05,106,107,2
2014-05,107,108,1
2014-05,108,109,1
2014-05,109,110,2
2014-05,110,111,2
2014-05,111,112,1
2014-05,113,114,1
2014-05,114,115,2
2014-05,115,116,1
2014-05,116,117,1
2014-05,117,118,2
2014-05,118,119,3
2014-05,119,120,1
2014-05,120,121,1
2014-05,122,123,1
2014-05,124,125,2
2014-05,125,126,3
2014-05,127,128,3
2014-05,128,129,3
2014-05,129,130,2
2014-05,133,134,1
2014-05,134,135,1
2014-05,138,139,3
2014-05,140,141,1
2014-05,142,143,2
2014-05,144,145,2
2014-05,145,146,2
2014-05,147,148,1
2014-05,150,151,3
2014-05,151,152,2
2014-05,152,153,2
2014-05,153,154,1
2014-05,154,155,2
2014-05,155,156,1
2014-05,157,158,1
2014-05,162,163,2
2014-05,164,165,1
2014-05,165,166,1
2014-05,167,168,1
2014-05,168,169,3
2014-05,169,170,1
2014-05,170,171,1
2014-05,172,173,1
2014-05,174,175,1
2014-05,179,180,2
2014-05,184,185,1
2014-05,188,189,1
2014-05,196,197,1
2014-05,200,201,2
2014-05,201,202,1
2014-05,216,217,1
2014-05,219,220,1
2014-05,220,221,1
2014-05,222,223,2
2014-05,239,240,2
2014-05,240,241,2
2014-05,246,247,2
2014-05,247,248,1
2014-05,256,257,1
2014-05,263,264,1
2014-05,268,269,1
2014-05,270,271,1
2014-05,308,309,1
2014-05,309,310,1
2014-05,310,311,1
2014-05,338,339,1
2014-05,341,342,2
2014-05,348,349,1
2014-05,354,355,1
2014-05,370,371,1
2014-05,371,372,1
2014-05,372,373,1
2014-05,373,374,1
2014-05,374,375,2
2014-05,383,384,1
2014-05,386,387,1
2014-05,393,394,1
2014-05,395,396,1
2014-05,396,397,1
2014-05,407,408,3
2014-05,408,409,1
2014-05,411,412,1
2014-05,412,413,1
2014-05,414,415,1
2014-05,419,420,1
2014-05,428,429,1
2014-05,437,438,1
2014-05,443,444,1
2014-05,444,445,1
2014-05,447,448,1
2014-05,453,454,1
2014-05,459,460,1
2014-05,474,475,2
2014-05,481,482,1
2014-05,487,488,1
2014-05,490,491,1
2014-05,494,495,1
2014-05,495,496,1
2014-05,497,498,1
2014-05,499,500,2
2014-05,503,504,1
2014-05,507,508,1
2014-05,523,524,1
2014-05,526,527,1
2014-05,528,529,2
2014-05,529,530,1
2014-05,535,536,1
2014-05,537,538,1
2014-05,547,548,1
2014-05,553,554,1
2014-05,563,564,1
2014-05,564,565,1
2014-05,565,566,1
2014-05,574,575,1
2014-05,580,581,2
2014-05,598,599,1
2014-05,616,617,1
2014-05,625,626,1
2014-05,654,655,2
2014-05,792,793,1
2014-05,898,899,1
2014-05,1099,1100,1
2014-05,2050,2051,1
2014-05,5579,5580,1
2014-06,0,1,273
2014-06,1,2,103
2014-06,2,3,104
2014-06,3,4,81
2014-06,4,5,72
2014-06,5,6,57
2014-06,6,7,70
2014-06,7,8,47
2014-06,8,9,46
2014-06,9,10,60
2014-06,10,11,41
2014-06,11,12,53
2014-06,12,13,53
2014-06,13,14,54
2014-06,14,15,51
2014-06,15,16,40
2014-06,16,17,52
2014-06,17,18,22
2014-06,18,19,42
2014-06,19,20,47
2014-06,20,21,30
2014-06,21,22,29
2014-06,22,23,17
2014-06,23,24,26
2014-06,24,25,22
2014-06,25,26,12
2014-06,26,27,11
2014-06,27,28,27
2014-06,28,29,17
2014-06,29,30,14
2014-06,30,31,27
2014-06,31,32,16
2014-06,32,33,16
2014-06,33,34,13
2014-06,34,35,8
2014-06,35,36,9
2014-06,36,37,11
2014-06,37,38,10
2014-06,38,39,7
2014-06,39,40,17
2014-06,40,41,16
2014-06,41,42,7
2014-06,42,43,6
2014-06,43,44,10
2014-06,44,45,7
2014-06,45,46,5
2014-06,46,47,6
2014-06,47,48,11
2014-06,48,49,10
2014-06,49,50,9
2014-06,50,51,10
2014-06,51,52,8
2014-06,52,53,7
2014-06,53,54,5
2014-06,54,55,11
2014-06,55,56,6
2014-06,56,57,8
2014-06,57,58,4
2014-06,58,59,4
2014-06,59,60,7
2014-06,60,61,3
2014-06,61,62,5
2014-06,62,63,4
2014-06,63,64,2
2014-06,64,65,5
2014-06,65,66,3
2014-06,66,67,2
2014-06,68,69,3
2014-06,69,70,5
2014-06,70,71,2
2014-06,71,72,4
2014-06,72,73,3
2014-06,73,74,1
2014-06,74,75,2
2014-06,75,76,4
2014-06,76,77,3
2014-06,78,79,1
2014-06,79,80,4
2014-06,80,81,2
2014-06,81,82,4
2014-06,82,83,1
2014-06,83,84,1
2014-06,84,85,3
2014-06,85,86,1
2014-06,86,87,2
2014-06,87,88,2
2014-06,88,89,2
2014-06,89,90,3
2014-06,90,91,2
2014-06,94,95,3
2014-06,95,96,1
2014-06,96,97,2
2014-06,97,98,3
2014-06,98,99,2
2014-06,99,100,1
2014-06,100,101,2
2014-06,102,103,2
2014-06,103,104,2
2014-06,104,105,2
2014-06,105,106,3
2014-06,107,108,1
2014-06,108,109,1
2014-06,111,112,1
2014-06,112,113,2
2014-06,113,114,2
2014-06,115,116,2
2014-06,116,117,1
2014-06,117,118,2
2014-06,118,119,2
2014-06,122,123,1
2014-06,124,125,3
2014-06,127,128,1
2014-06,128,129,3
2014-06,130,131,1
2014-06,133,134,2
2014-06,135,136,1
2014-06,138,139,1
2014-06,139,140,1
2014-06,140,141,1
2014-06,142,143,2
2014-06,143,144,1
2014-06,145,146,2
2014-06,147,148,2
2014-06,149,150,1
2014-06,151,152,1
2014-06,152,153,1
2014-06,153,154,1
2014-06,159,160,1
2014-06,169,170,1
2014-06,170,171,2
2014-06,172,173,1
2014-06,173,174,2
2014-06,174,175,2
2014-06,175,176,1
2014-06,176,177,2
2014-06,177,178,1
2014-06,178,179,1
2014-06,179,180,1
2014-06,184,185,1
2014-06,186,187,1
2014-06,188,189,1
2014-06,192,193,1
2014-06,194,195,1
2014-06,197,198,3
2014-06,199,200,1
2014-06,201,202,1
2014-06,204,205,1
2014-06,213,214,1
2014-06,218,219,1
2014-06,220,221,1
2014-06,221,222,1
2014-06,222,223,1
2014-06,228,229,1
2014-06,230,231,1
2014-06,234,235,1
2014-06,240,241,1
2014-06,241,242,1
2014-06,242,243,1
2014-06,243,244,2
2014-06,245,246,3
2014-06,247,248,1
2014-06,250,251,2
2014-06,256,257,1
2014-06,259,260,1
2014-06,261,262,1
2014-06,264,265,1
2014-06,265,266,1
2014-06,271,272,1
2014-06,276,277,1
2014-06,277,278,3
2014-06,285,286,1
2014-06,297,298,1
2014-06,302,303,1
2014-06,307,308,1
2014-06,310,311,1
2014-06,313,314,1
2014-06,314,315,1
2014-06,316,317,1
2014-06,324,325,1
2014-06,325,326,1
2014-06,334,335,1
2014-06,338,339,1
2014-06,347,348,2
2014-06,348,349,1
2014-06,352,353,1
2014-06,355,356,1
2014-06,360,361,1
2014-06,378,379,1
2014-06,382,383,1
2014-06,400,401,2
2014-06,409,410,1
2014-06,410,411,1
2014-06,411,412,1
2014-06,435,436,1
2014-06,474,475,1
2014-06,504,505,1
2014-06,598,599,1
2014-06,696,697,1
2014-06,792,793,1
2014-06,1002,1003,1
2014-06,1028,1029,1
2014-06,1099,1100,1
2014-06,2059,2060,1
