month,queue,newtickets
2013-07,ar,9
2013-07,en,752
2013-07,es,15
2013-07,fa,125
2013-07,fr,10
2013-07,zh,11
2013-08,ar,6
2013-08,en,795
2013-08,es,18
2013-08,fa,162
2013-08,fr,10
2013-08,zh,12
2013-09,ar,7
2013-09,en,597
2013-09,es,18
2013-09,fa,48
2013-09,fr,12
2013-09,zh,8
