{
  "tor-meetup-brussels": {
    "title": "Tor Meetup (Brussels)",
    "author": "steph",
    "start_date": "2019-11-08"
  },
  "jacob-info-activism-camp-bangalore-india": {
    "title": "Jacob at Info-Activism Camp in Bangalore, India",
    "author": "ioerror",
    "start_date": "2009-02-17",
    "end_date": "2009-02-27"
  },
  "driving-it-aarhus": {
    "title": "Driving IT (Aarhus)",
    "author": "steph",
    "start_date": "2020-03-05"
  },
  "tor-meetup-athens": {
    "title": "Tor Meetup (Athens)",
    "author": "steph",
    "start_date": "2019-01-25"
  },
  "tor-contact-summit-2011": {
    "title": "Tor at Contact Summit 2011",
    "author": "phobos",
    "start_date": "2011-10-21"
  },
  "internet-dissent-and-authoritarianism-control-and-resistance-era-social-media": {
    "title": "Internet, Dissent and Authoritarianism: Control and Resistance in an Era of Social Media",
    "author": "phobos",
    "start_date": "2011-04-20"
  },
  "zcon2lite-network-privacy": {
    "title": "Zcon2 Lite - \"Network Privacy\"",
    "author": "ggus",
    "start_date": "2021-06-09"
  },
  "privacy-cafe-lisbon": {
    "title": "Privacy Cafe (Lisbon)",
    "author": "steph",
    "start_date": "2020-02-15"
  },
  "rightscon-tor-panel-building-strategies-to-diversify-funds": {
    "title": "RightsCon Tor Panel: Building strategies to diversify funds",
    "author": "arma",
    "start_date": "2021-06-07",
    "end_date": "2021-06-11"
  },
  "andrew-mobile-4-change-barcamp": {
    "title": "Andrew at Mobile 4 Change Barcamp",
    "author": "phobos",
    "start_date": "2009-02-21",
    "end_date": "2009-02-22"
  },
  "tor-meetup-lisbon": {
    "title": "Tor Meetup (Lisbon)",
    "author": "steph",
    "start_date": "2019-02-23"
  },
  "tor-friends-and-relay-operators-meetup-2-qbi-vasilis-and-others-onionspace-berlin": {
    "title": "Tor Friends and Relay Operators Meetup #2 with qbi, vasilis, and others at Onionspace (Berlin)",
    "author": "andz",
    "start_date": "2018-08-25"
  },
  "full-stack-fest-barcelona": {
    "title": "Full Stack Fest (Barcelona)",
    "author": "steph",
    "start_date": "2018-09-03",
    "end_date": "2018-09-04"
  },
  "andrew-advisory-council-child-trafficking-symposium": {
    "title": "Andrew @ The Advisory Council on Child Trafficking Symposium",
    "author": "phobos",
    "start_date": "2013-05-01"
  },
  "tor-meetup-sao-paulo-brasil": {
    "title": "Tor Meetup S\u00e3o Paulo (Brasil)",
    "author": "ggus",
    "start_date": "2019-05-02"
  },
  "tor-pets-2014-amsterdam": {
    "title": "Tor @ PETS 2014, Amsterdam",
    "author": "kelley",
    "start_date": "2014-07-16",
    "end_date": "2014-07-18"
  },
  "roger-speaks-hackcon-oslo": {
    "title": "Roger speaks at Hackcon in Oslo",
    "author": "arma",
    "start_date": "2008-02-07"
  },
  "vasilis-tor-gathering-garoa-hacker-clube-sao-paulo-brazil": {
    "title": "Vasilis at Tor gathering (Garoa Hacker Clube), Sao Paulo, Brazil",
    "author": "andz",
    "start_date": "2017-05-11",
    "end_date": "2017-05-12"
  },
  "relay-operator-meetup": {
    "title": "Relay Operator Meetup",
    "author": "tommy",
    "start_date": "2017-10-14"
  },
  "privchat-5-pegasus": {
    "title": "Privchat #5: Pegasus",
    "author": "arma",
    "start_date": "2021-09-27"
  },
  "defcon-toronto-meetup": {
    "title": "DEFCON Toronto Meetup",
    "author": "steph",
    "start_date": "2018-09-20"
  },
  "roger-nick-mike-steven-matt-karsten-paul-jacob-pets": {
    "title": "Roger, Nick, Mike, Steven, Matt, Karsten, Paul, Jacob at PETS",
    "author": "arma",
    "start_date": "2008-07-23",
    "end_date": "2008-07-27"
  },
  "andrew-new-england-give-camp": {
    "title": "Andrew @ New England Give Camp",
    "author": "phobos",
    "start_date": "2013-04-26",
    "end_date": "2013-04-28"
  },
  "mit-knight-civic-media-conference": {
    "title": "MIT-Knight Civic Media Conference",
    "author": "phobos",
    "start_date": "2012-06-17",
    "end_date": "2012-06-19"
  },
  "alisonlfp-speaks-university-michigan-ann-arbor": {
    "title": "Alison/LFP speaks at University of Michigan, Ann Arbor",
    "author": "alison",
    "start_date": "2017-04-05"
  },
  "tor-stockholm-internet-forum": {
    "title": "Tor @ Stockholm Internet Forum",
    "author": "phobos",
    "start_date": "2014-05-27",
    "end_date": "2014-05-29"
  },
  "sukhbir-cjfes-digital-self-defence-2017": {
    "title": "Sukhbir at CJFE's Digital Self Defence 2017",
    "author": "sukhbir",
    "start_date": "2017-10-29"
  },
  "roger-speaks-harvard-crcs": {
    "title": "Roger speaks at Harvard CRCS",
    "author": "arma",
    "start_date": "2008-03-19"
  },
  "cebolizando-campinas": {
    "title": "Cebolizando (Campinas)",
    "author": "ggus",
    "start_date": "2019-12-12"
  },
  "vasilis-and-others-tor-meetup-mutirao-lab-rio-de-janeiro-brazil": {
    "title": "Vasilis and others at Tor meetup, Mutir\u00e3o Lab, Rio de Janeiro, Brazil",
    "author": "andz",
    "start_date": "2017-10-27"
  },
  "tors-open-hack-days-mexico-city": {
    "title": "Tor's Open Hack Days (Mexico City)",
    "author": "steph",
    "start_date": "2018-10-02",
    "end_date": "2018-10-03"
  },
  "join-us-tor-project-public-hack-day-event-munich-germany": {
    "title": "JOIN US - Tor Project Public Hack Day Event, Munich, Germany",
    "author": "kelley",
    "start_date": "2013-07-26"
  },
  "runa-digital-security-event-new-york-city-ny": {
    "title": "Runa @ Digital Security Event, New York City, NY",
    "author": "kelley",
    "start_date": "2013-10-28"
  },
  "roger-pets-2013-bloomington": {
    "title": "Roger @ PETS 2013, Bloomington, IN",
    "author": "kelley",
    "start_date": "2013-07-10",
    "end_date": "2013-07-12"
  },
  "tor-meetup-ekospace-buenos-aires-argentina": {
    "title": "Tor Meetup at EKOspace, Buenos Aires, Argentina",
    "author": "andz",
    "start_date": "2017-10-04"
  },
  "roger-petools-workshop-privacy-enhancing-tools-bloomington": {
    "title": "Roger @ PETools: Workshop on Privacy Enhancing Tools, Bloomington, IN",
    "author": "kelley",
    "start_date": "2013-07-09"
  },
  "tor-igf-2010": {
    "title": "Tor at IGF 2010",
    "author": "phobos",
    "start_date": "2010-09-14"
  },
  "tor-silicon-valley-human-rights-conference": {
    "title": "Tor at Silicon Valley Human Rights Conference",
    "author": "phobos",
    "start_date": "2011-10-25",
    "end_date": "2011-10-27"
  },
  "isis-lovecruft-speaking-university-waterloo": {
    "title": "Isis Lovecruft speaking at University of Waterloo",
    "author": "isis",
    "start_date": "2016-10-13"
  },
  "bornhack-funen-denmark": {
    "title": "BornHack (Funen, Denmark)",
    "author": "steph",
    "start_date": "2019-08-08",
    "end_date": "2019-08-15"
  },
  "nima-presents-dcaps": {
    "title": "Nima presents at DCAPS",
    "author": "mrphs",
    "start_date": "2016-06-20"
  },
  "world-press-freedom-day": {
    "title": "World Press Freedom Day",
    "author": "phobos",
    "start_date": "2011-05-03"
  },
  "andrew-cimaned-panel": {
    "title": "Andrew at CIMA/NED Panel",
    "author": "phobos",
    "start_date": "2009-07-07"
  },
  "foci-and-usenix-security-vancouver": {
    "title": "FOCI and Usenix Security, Vancouver",
    "author": "arma",
    "start_date": "2017-08-14",
    "end_date": "2017-08-19"
  },
  "nick-real-world-cryptography-2016": {
    "title": "Nick at Real World Cryptography 2016",
    "author": "nickm",
    "start_date": "2016-01-06",
    "end_date": "2016-01-08"
  },
  "vasilis-uespi-teresina-brazil": {
    "title": "Vasilis at UESPI, Teresina, Brazil",
    "author": "andz",
    "start_date": "2017-09-23"
  },
  "bsd-tor-bridge-installfest": {
    "title": "*BSD Tor Bridge Installfest",
    "author": "steph",
    "start_date": "2017-10-04"
  },
  "florence-hackfest": {
    "title": "Florence Hackfest",
    "author": "phobos",
    "start_date": "2012-07-05",
    "end_date": "2012-07-06"
  },
  "know-2019-vegas": {
    "title": "KNOW 2019 (Vegas)",
    "author": "steph",
    "start_date": "2018-03-24",
    "end_date": "2018-03-27"
  },
  "censorship-resistance-fur-den-anonymisierungsdienst-tor-hagenberg": {
    "title": "Censorship Resistance f\u00fcr den Anonymisierungsdienst Tor (Hagenberg)",
    "author": "steph",
    "start_date": "2020-01-09"
  },
  "karen-and-runa-doing-reddit-ama": {
    "title": "Karen and Runa doing Reddit AMA",
    "author": "phobos",
    "start_date": "2012-06-21"
  },
  "isabela-will-join-mdf-annual-meeting-panel-privacy-security-and-anonymity": {
    "title": "Isabela will join MDF Annual meeting panel on: Privacy, Security and Anonymity",
    "author": "isabela",
    "start_date": "2017-11-30"
  },
  "alison-presenting-temple-university-philadelphia": {
    "title": "Alison presenting at Temple University in Philadelphia",
    "author": "alison",
    "start_date": "2017-05-22"
  },
  "andrew-wesleyan-university": {
    "title": "Andrew at Wesleyan University",
    "author": "phobos",
    "start_date": "2010-06-08"
  },
  "tor-ars-electronica-2010-festival": {
    "title": "Tor at Ars Electronica 2010 Festival",
    "author": "phobos",
    "start_date": "2010-09-02",
    "end_date": "2010-09-11"
  },
  "bitcoin2020-sanfrancisco": {
    "title": "Bitcoin2020 (San Francisco) **Cancelled",
    "author": "steph",
    "start_date": "2020-03-27",
    "end_date": "2020-03-28"
  },
  "jacob-bluehat": {
    "title": "Jacob at Bluehat",
    "author": "ioerror",
    "start_date": "2010-10-14",
    "end_date": "2010-10-15"
  },
  "roger-nsf-watch-seminar-series-arlington-va": {
    "title": "Roger @ NSF WATCH Seminar Series, Arlington, VA",
    "author": "kelley",
    "start_date": "2014-01-14"
  },
  "tor-journalists-explore-tor-nyc": {
    "title": "Tor for Journalists [Explore Tor, NYC!]",
    "author": "steph",
    "start_date": "2018-04-12"
  },
  "jacob-panelist-future-internet-freedom": {
    "title": "Jacob panelist at The Future of Internet Freedom",
    "author": "phobos",
    "start_date": "2011-04-14",
    "end_date": "2011-04-15"
  },
  "roger-andrew-7th-chinese-internet-research-conference": {
    "title": "Roger, Andrew at 7th Chinese Internet Research Conference",
    "author": "arma",
    "start_date": "2009-05-27",
    "end_date": "2009-05-28"
  },
  "roger-budapest-global-voices-summit": {
    "title": "Roger in Budapest for Global Voices Summit",
    "author": "arma",
    "start_date": "2008-06-25",
    "end_date": "2008-06-28"
  },
  "tor-training-abraji-sao-paulo": {
    "title": "Tor training with ABRAJI (S\u00e3o Paulo)",
    "author": "ggus",
    "start_date": "2018-11-28"
  },
  "usenix-security-2020": {
    "title": "Walking Onions @ USENIX Security Symposium '20",
    "author": "ggus",
    "start_date": "2020-08-12",
    "end_date": "2020-08-14"
  },
  "snowflake-iff-cks": {
    "title": "Q&A with The Tor\u2019s Circumvention Lead About Snowflake (IFF - CKS)",
    "author": "ggus",
    "start_date": "2021-03-30"
  },
  "tor-workshop-strike-spa-roma": {
    "title": "Tor Workshop - Strike SPA (Roma)",
    "author": "ggus",
    "start_date": "2019-11-16"
  },
  "rightscon-tunis": {
    "title": "RightsCon (Tunis)",
    "author": "steph",
    "start_date": "2019-06-11",
    "end_date": "2019-06-14"
  },
  "privacy-enhancing-technologies-symposium-pets": {
    "title": "Privacy Enhancing Technologies Symposium (PETS)",
    "author": "arma",
    "start_date": "2021-07-12",
    "end_date": "2021-07-16"
  },
  "criptobaile-brasilia": {
    "title": "Criptobaile (Bras\u00edlia)",
    "author": "ggus",
    "start_date": "2019-12-14"
  },
  "run-and-use-tor-bridges-irc-meetup": {
    "title": "Run and use Tor Bridges to bypass censorship and surveillance! (Online)",
    "author": "ggus",
    "start_date": "2020-05-29"
  },
  "kelley-journalist-training-event-helsiniki-finland": {
    "title": "Kelley @ Journalist Training Event, Helsiniki, Finland",
    "author": "kelley",
    "start_date": "2013-10-11"
  },
  "roger-talks-eth-zurich": {
    "title": "Roger talks at ETH Zurich",
    "author": "arma",
    "start_date": "2010-04-20",
    "end_date": "2010-04-22"
  },
  "andrew-roger-and-paul-itsg": {
    "title": "Andrew, Roger, and Paul at ITSG",
    "author": "phobos",
    "start_date": "2010-10-12",
    "end_date": "2010-10-15"
  },
  "roger-lecturing-stanford": {
    "title": "Roger lecturing at Stanford",
    "author": "phobos",
    "start_date": "2010-10-23"
  },
  "several-tor-people-attending-real-world-crypto-nyc": {
    "title": "Several Tor people attending Real World Crypto in NYC",
    "author": "nickm",
    "start_date": "2017-01-04",
    "end_date": "2017-01-06"
  },
  "tor-meetup-germany": {
    "title": "Tor Meetup (Germany)",
    "author": "ggus",
    "start_date": "2019-06-01"
  },
  "onion-services-talk-flisol-ranchero": {
    "title": "Servicios Onion: \"una cebolla por d\u00eda mantiene a la vigilancia lejos\" (Flisol Ranchero)",
    "author": "ggus",
    "start_date": "2021-04-23"
  },
  "tor-meetup-ciudad-de-mexico": {
    "title": "Tor Meetup Ciudad de M\u00e9xico",
    "author": "ggus",
    "start_date": "2018-09-27"
  },
  "tor-fosdem-2020-brussels": {
    "title": "FOSDEM 2020 (Brussels)",
    "author": "steph",
    "start_date": "2020-02-01"
  },
  "runa-computers-freedom-and-privacy-conference-dc": {
    "title": "Runa @ Computers, Freedom and Privacy Conference, DC",
    "author": "kelley",
    "start_date": "2013-06-25",
    "end_date": "2013-06-26"
  },
  "sukhbir-presenting-gtalug-toronto": {
    "title": "Sukhbir presenting at GTALUG in Toronto",
    "author": "sukhbir",
    "start_date": "2017-08-08"
  },
  "gsoc-mentors-gsoc-mentor-summit-mountain-view": {
    "title": "GSoC mentors at GSoC mentor summit, Mountain View",
    "author": "arma",
    "start_date": "2010-10-22",
    "end_date": "2010-10-25"
  },
  "roger-keynotes-at-cybersec-ai": {
    "title": "Roger keynotes at CyberSec&AI",
    "author": "arma",
    "start_date": "2020-10-08"
  },
  "20th-acm-conference-computer-and-communications-security-berlin-germany": {
    "title": "20th ACM Conference on Computer and Communications Security, Berlin, Germany",
    "author": "kelley",
    "start_date": "2013-11-04",
    "end_date": "2013-11-05"
  },
  "tor-meetup-athens-0": {
    "title": "Tor Meetup (Athens)",
    "author": "steph",
    "start_date": "2019-05-25"
  },
  "andrew-talking-international-modern-media-institute": {
    "title": "Andrew talking to International Modern Media Institute",
    "author": "phobos",
    "start_date": "2011-05-12"
  },
  "driving-it-copenhagen": {
    "title": "Driving IT (Copenhagen)",
    "author": "steph",
    "start_date": "2019-11-01"
  },
  "jacoblinus-nordunet-conference": {
    "title": "Jacob/Linus at NORDUnet Conference",
    "author": "phobos",
    "start_date": "2011-06-07",
    "end_date": "2011-06-09"
  },
  "roger-kaist-korea": {
    "title": "Roger at Kaist in Korea",
    "author": "arma",
    "start_date": "2009-11-09",
    "end_date": "2009-11-13"
  },
  "mortiz-youth-internet-governance-forum-berlin-germany": {
    "title": "Mortiz @ Youth Internet Governance Forum, Berlin, Germany",
    "author": "kelley",
    "start_date": "2013-06-01"
  },
  "roger-and-nick-shmoocon": {
    "title": "Roger and Nick at Shmoocon",
    "author": "arma",
    "start_date": "2008-02-15",
    "end_date": "2008-02-17"
  },
  "criptofesta-sao-paulo-0": {
    "title": "Criptofesta (S\u00e3o Paulo)",
    "author": "ggus",
    "start_date": "2019-12-07"
  },
  "vasilis-gus-and-others-cryptofesta-tor-meetup-sao-paulo-brazil": {
    "title": "Vasilis, Gus and others at Cryptofesta - Tor meetup, S\u00e3o Paulo, Brazil",
    "author": "andz",
    "start_date": "2017-08-26"
  },
  "criptocumbion-en-el-rancho-mexico": {
    "title": "Criptocumbi\u00f3n en el rancho (Mexico)",
    "author": "ggus",
    "start_date": "2019-05-18"
  },
  "relay-operators-meetup-hamburg": {
    "title": "Relay Operators Meetup (Hamburg)",
    "author": "steph",
    "start_date": "2018-08-31"
  },
  "many-tor-people-leipzig-ccc": {
    "title": "Many Tor people to Leipzig for CCC",
    "author": "arma",
    "start_date": "2017-12-27",
    "end_date": "2017-12-30"
  },
  "runa-hackhackers-africa-digital-security-and-encryption-journalists-johannesburg": {
    "title": "Runa @ Hack/Hackers Africa - Digital Security and Encryption for Journalists, Johannesburg",
    "author": "kelley",
    "start_date": "2013-05-08"
  },
  "nick-and-paul-foreign-policy-magazine-global-thinkers-event-dc": {
    "title": "Nick and Paul at Foreign Policy Magazine \\\"Global Thinkers\\\" event in DC",
    "author": "arma",
    "start_date": "2015-12-01",
    "end_date": "2015-12-02"
  },
  "alisonlfp-speaks-tennessee-library-associations-intellectual-freedom-luncheon": {
    "title": "Alison/LFP speaks at the Tennessee Library Association's Intellectual Freedom Luncheon",
    "author": "alison",
    "start_date": "2017-04-06"
  },
  "reunion-de-operadoras-y-operadores-mexico": {
    "title": "Reuni\u00f3n de operadoras y operadores (M\u00e9xico)",
    "author": "ggus",
    "start_date": "2019-05-20"
  },
  "tor-libreplanet-boston": {
    "title": "Tor at LibrePlanet, Boston",
    "author": "mrphs",
    "start_date": "2016-03-19",
    "end_date": "2016-03-20"
  },
  "many-tor-people-ccc-hamburg": {
    "title": "Many Tor people at CCC in Hamburg",
    "author": "arma",
    "start_date": "2015-12-27"
  },
  "real-world-crypto-virtual": {
    "title": "Real World Crypto (virtual)",
    "author": "arma",
    "start_date": "2021-01-11",
    "end_date": "2021-01-14"
  },
  "roger-presents-croatia-summer-school": {
    "title": "Roger presents at Croatia summer school",
    "author": "arma",
    "start_date": "2016-06-05",
    "end_date": "2016-06-10"
  },
  "mozfest-london": {
    "title": "MozFest (London)",
    "author": "steph",
    "start_date": "2019-10-21",
    "end_date": "2019-10-27"
  },
  "roger-san-diego": {
    "title": "Roger in San Diego",
    "author": "arma",
    "start_date": "2008-10-21",
    "end_date": "2008-10-24"
  },
  "freedom-not-fear-brussels": {
    "title": "Freedom not Fear (Brussels)",
    "author": "ggus",
    "start_date": "2019-11-09",
    "end_date": "2019-11-10"
  },
  "privchat-privacy-in-2020-censorship-circumvention": {
    "title": "PrivChat with Tor - \"The Good, the Bad, and the Ugly of Censorship Circumvention\" (live stream)",
    "author": "antonela",
    "start_date": "2020-08-28"
  },
  "andrew-barcamp-boston": {
    "title": "Andrew at BarCamp Boston",
    "author": "phobos",
    "start_date": "2009-04-25"
  },
  "seagl-seattle": {
    "title": "SeaGL (Seattle)",
    "author": "steph",
    "start_date": "2019-11-15",
    "end_date": "2019-11-16"
  },
  "tor-london-cybersecurity-summit": {
    "title": "Tor at London Cybersecurity Summit",
    "author": "phobos",
    "start_date": "2011-06-02",
    "end_date": "2011-06-03"
  },
  "jake-stockholm-internet-forum-conference-stockholm": {
    "title": "Jake @ Stockholm Internet Forum Conference, Stockholm",
    "author": "kelley",
    "start_date": "2013-05-22"
  },
  "andrew-hakkavelin": {
    "title": "Andrew at Hakkav\u00e9lin",
    "author": "phobos",
    "start_date": "2011-05-13"
  },
  "explore-tor-nyc-meetup-and-qa-feb-15": {
    "title": "Explore Tor, NYC! Meetup and Q&A On Feb 15",
    "author": "steph",
    "start_date": "2018-02-15"
  },
  "andrew-libreplanet-2009": {
    "title": "Andrew at LibrePlanet 2009",
    "author": "phobos",
    "start_date": "2009-03-21",
    "end_date": "2009-03-22"
  },
  "pets-stockholm": {
    "title": "PETS (Stockholm)",
    "author": "steph",
    "start_date": "2019-07-16",
    "end_date": "2019-07-20"
  },
  "isabela-leading-tor-workshop-allied-media-conference-2016": {
    "title": "Isabela leading Tor workshop at Allied Media Conference 2016",
    "author": "isabela",
    "start_date": "2016-06-19"
  },
  "roger-george-mason-university-washington-dc": {
    "title": "Roger @ George Mason University, Washington, DC",
    "author": "kelley",
    "start_date": "2014-04-11"
  },
  "moritz-pixelache-festival-helsinki-finland-tallinn-estonia": {
    "title": "Moritz @ Pixelache Festival, Helsinki, Finland / Tallinn, Estonia",
    "author": "kelley",
    "start_date": "2013-05-16",
    "end_date": "2013-05-19"
  },
  "jacob-speaking-hope-2010": {
    "title": "Jacob speaking at HOPE 2010",
    "author": "phobos",
    "start_date": "2010-07-16",
    "end_date": "2010-07-18"
  },
  "jacob-attending-workshop-elliptic-curve-computation": {
    "title": "Jacob attending the Workshop on Elliptic Curve Computation",
    "author": "ioerror",
    "start_date": "2010-10-18",
    "end_date": "2010-10-22"
  },
  "roger-nick-steven-jake-paul-others-pets-2009": {
    "title": "Roger, Nick, Steven, Jake, Paul, others at PETS 2009",
    "author": "arma",
    "start_date": "2009-08-03",
    "end_date": "2009-08-08"
  },
  "andrew-nnedv-conference": {
    "title": "Andrew at NNEDV Conference",
    "author": "phobos",
    "start_date": "2011-08-08",
    "end_date": "2011-08-09"
  },
  "tors-winter-2014-developers-meeting-reykjavik-iceland": {
    "title": "Tor's Winter 2014 Developers Meeting, Reykjavik, Iceland",
    "author": "kelley",
    "start_date": "2014-02-17",
    "end_date": "2014-02-21"
  },
  "peeling-onions-ens-paris": {
    "title": "Peeling Onions at ENS in Paris",
    "author": "steph",
    "start_date": "2018-02-28"
  },
  "anonymous-browsing-tor-toronto-public-library": {
    "title": "Anonymous Browsing with Tor (Toronto Public Library)",
    "author": "steph",
    "start_date": "2018-11-14"
  },
  "karen-and-kelley-virtual-economy-potential-perplexities-and-promises-washington-dc": {
    "title": "Karen and Kelley @ The Virtual Economy: Potential, Perplexities, and Promises, Washington DC",
    "author": "kelley",
    "start_date": "2013-06-13"
  },
  "pets-2020": {
    "title": "Privacy Enhancing Technologies Symposium (online!)",
    "author": "arma",
    "start_date": "2020-07-13",
    "end_date": "2020-07-17"
  },
  "roger-rightscon-manila": {
    "title": "Roger at RightsCon in Manila",
    "author": "harmony",
    "start_date": "2015-03-24"
  },
  "tor-aromi-e-lacrime-del-routing-cipolla-naples": {
    "title": "Tor: Aromi e lacrime del routing a cipolla (Naples)",
    "author": "ggus",
    "start_date": "2019-10-23"
  },
  "know-2019-vegas-0": {
    "title": "KNOW 2019 (Vegas)",
    "author": "steph",
    "start_date": "2019-03-24",
    "end_date": "2019-03-27"
  },
  "pune-india-meetup": {
    "title": "Pune, India Meetup",
    "author": "steph",
    "start_date": "2018-04-18"
  },
  "tors-summer-dev-meeting-paris-france": {
    "title": "Tor's Summer Dev Meeting - Paris, France",
    "author": "kelley",
    "start_date": "2014-06-30",
    "end_date": "2014-07-04"
  },
  "criptocerrado-brasilia": {
    "title": "Criptocerrado (Bras\u00edlia)",
    "author": "ggus",
    "start_date": "2018-12-15"
  },
  "karen-speaking-university-maryland-digital-media-conference": {
    "title": "Karen speaking at University of Maryland Digital Media Conference",
    "author": "phobos",
    "start_date": "2010-03-03"
  },
  "roger-ieee-symposium-san-francisco": {
    "title": "Roger @ IEEE Symposium, San Francisco",
    "author": "kelley",
    "start_date": "2013-05-20",
    "end_date": "2013-05-22"
  },
  "libreplanet-2021-tor-improves-ux-without-compromising-privacy": {
    "title": "Usable security for end-users: How Tor improves usability without compromising user privacy (LibrePlanet 2021)",
    "author": "ggus",
    "start_date": "2021-03-20"
  },
  "civil-rights-defenders-defenders-days": {
    "title": "Civil Rights Defenders, Defender's Days",
    "author": "phobos",
    "start_date": "2014-04-01",
    "end_date": "2014-04-04"
  },
  "internet-freedom-festival": {
    "title": "Internet Freedom Festival",
    "author": "arma",
    "start_date": "2016-03-01",
    "end_date": "2016-03-07"
  },
  "vasilis-i-semana-de-computacao-caxias-maranhao-brazil": {
    "title": "Vasilis at I semana de computa\u00e7\u00e3o, Caxias, Maranh\u00e3o, Brazil",
    "author": "andz",
    "start_date": "2017-09-27"
  },
  "first-amendment-21st-century-pittsburgh": {
    "title": "The First Amendment for the 21st Century (Pittsburgh)",
    "author": "steph",
    "start_date": "2018-06-21",
    "end_date": "2018-06-22"
  },
  "torsiendo-la-censura-navegacion-anonima-en-internet-mexico": {
    "title": "TorSiendo la censura, navegaci\u00f3n an\u00f3nima en internet (M\u00e9xico)",
    "author": "ggus",
    "start_date": "2019-05-11"
  },
  "fosdem-2010-tor-building-growing-and-extending-online-anonymity": {
    "title": "FOSDEM 2010:  Tor: Building, Growing, and Extending Online Anonymity",
    "author": "phobos",
    "start_date": "2010-02-06"
  },
  "tor-speaking-def-con-18": {
    "title": "Tor speaking at DEF CON 18",
    "author": "phobos",
    "start_date": "2010-07-30",
    "end_date": "2010-08-01"
  },
  "cryptoparty-london": {
    "title": "CryptoParty (London)",
    "author": "steph",
    "start_date": "2018-07-16"
  },
  "roger-does-tor-talk-mcgill": {
    "title": "Roger does Tor talk at McGill",
    "author": "arma",
    "start_date": "2017-10-16"
  },
  "tor-defcon-19": {
    "title": "Tor at DEFCON 19",
    "author": "phobos",
    "start_date": "2011-08-05"
  },
  "nullcon-goa": {
    "title": "Nullcon (Goa)",
    "author": "steph",
    "start_date": "2019-03-01",
    "end_date": "2019-03-03"
  },
  "democracy-dissent-and-digital-media-arab-world": {
    "title": "Democracy, Dissent, and Digital Media in the Arab World",
    "author": "phobos",
    "start_date": "2011-03-01"
  },
  "ilv-gus-vasilis-and-others-primavera-hacker-17-santiago-chile": {
    "title": "ilv, gus, vasilis and others at Primavera Hacker 17, Santiago, Chile",
    "author": "andz",
    "start_date": "2017-12-02",
    "end_date": "2017-12-03"
  },
  "tor-financial-crypto-2014-barbados": {
    "title": "Tor @ Financial Crypto 2014, Barbados",
    "author": "kelley",
    "start_date": "2014-03-03"
  },
  "isabela-present-dados-protegidos-eventvigilancia-y-bibliotecas": {
    "title": "Isabela to present at Dados Protegidos event:Vigilancia y Bibliotecas",
    "author": "isabela",
    "start_date": "2016-11-03"
  },
  "roger-and-steph-and-others-def-con-las-vegas": {
    "title": "Roger and Steph and others at DEF CON (Las Vegas)",
    "author": "arma",
    "start_date": "2018-08-09",
    "end_date": "2018-08-12"
  },
  "explore-tor-nyc-run-relay": {
    "title": "[Explore Tor, NYC!] Run a Relay",
    "author": "steph",
    "start_date": "2017-12-07"
  },
  "cccamp-germany": {
    "title": "CCCamp (Germany)",
    "author": "ggus",
    "start_date": "2019-08-21",
    "end_date": "2019-08-25"
  },
  "future-speech-online-dc": {
    "title": "The Future of Speech Online (D.C.)",
    "author": "steph",
    "start_date": "2019-11-15"
  },
  "tor-intro-lhc-2020": {
    "title": "Tor introduction @ LHC (Campinas)",
    "author": "ggus",
    "start_date": "2020-11-26"
  },
  "roger-jacob-steven-berlin": {
    "title": "Roger, Jacob, Steven in Berlin",
    "author": "arma",
    "start_date": "2008-12-26",
    "end_date": "2008-12-31"
  },
  "tor-meeting-san-francisco": {
    "title": "Tor Meeting up San Francisco",
    "author": "root",
    "start_date": "2008-01-24"
  },
  "andrew-soul-new-machine-conference": {
    "title": "Andrew at Soul of a New Machine Conference",
    "author": "phobos",
    "start_date": "2009-05-04",
    "end_date": "2009-05-05"
  },
  "many-ooni-and-tor-people-berlin-ooni-hackathon": {
    "title": "Many OONI and Tor people to Berlin for OONI hackathon",
    "author": "andz",
    "start_date": "2016-11-11",
    "end_date": "2016-11-13"
  },
  "andrew-secure-poland": {
    "title": "Andrew @ Secure Poland",
    "author": "phobos",
    "start_date": "2013-10-09",
    "end_date": "2013-10-10"
  },
  "reproducible-builds-summit-marrakesh-2019": {
    "title": "Reproducible Builds summit in Marrakesh 2019",
    "author": "boklm",
    "start_date": "2019-12-03",
    "end_date": "2019-12-05"
  },
  "swiss-web-security-day-bern": {
    "title": "Swiss Web Security Day (Bern)",
    "author": "steph",
    "start_date": "2019-10-30"
  },
  "rustconf-portland": {
    "title": "RustConf (Portland)",
    "author": "steph",
    "start_date": "2018-08-17"
  },
  "internet-e-anonimato-la-rete-tor-firenze": {
    "title": "Internet e anonimato: la rete Tor (Firenze)",
    "author": "ggus",
    "start_date": "2019-11-06"
  },
  "it-defense-stuttgart": {
    "title": "IT Defense (Stuttgart)",
    "author": "steph",
    "start_date": "2019-02-06",
    "end_date": "2019-02-08"
  },
  "rightscon-toronto": {
    "title": "RightsCon (Toronto)",
    "author": "steph",
    "start_date": "2018-05-16",
    "end_date": "2018-05-18"
  },
  "roger-uc-berkeley-school-information": {
    "title": "Roger at UC Berkeley School of Information",
    "author": "phobos",
    "start_date": "2011-04-19"
  },
  "cybersec-ai-prague": {
    "title": "CyberSec & AI (Prague)",
    "author": "steph",
    "start_date": "2020-10-08",
    "end_date": "2020-10-09"
  },
  "nima-holds-tor-ama-session-rightscon-sf": {
    "title": "Nima holds a Tor AMA session at Rightscon in SF",
    "author": "mrphs",
    "start_date": "2016-03-30",
    "end_date": "2016-04-01"
  },
  "jacob-recon-2011": {
    "title": "Jacob at recon 2011",
    "author": "phobos",
    "start_date": "2011-07-08",
    "end_date": "2011-07-10"
  },
  "andrew-nnedv": {
    "title": "Andrew at NNEDV",
    "author": "phobos",
    "start_date": "2008-08-11"
  },
  "many-tor-people-baltimore-otf-summit": {
    "title": "Many Tor people to Baltimore for OTF summit",
    "author": "arma",
    "start_date": "2016-10-18",
    "end_date": "2016-10-20"
  },
  "roger-isci-198430-panel-uc-berkeley": {
    "title": "Roger @ ISCI \u201c1984+30\u201d panel, UC Berkeley",
    "author": "lunar",
    "start_date": "2014-10-06"
  },
  "roger-speaks-sourceboston": {
    "title": "Roger speaks at SourceBoston",
    "author": "arma",
    "start_date": "2008-03-13",
    "end_date": "2008-03-14"
  },
  "andrew-access-and-privacy-workshop-2009": {
    "title": "Andrew at Access and Privacy Workshop 2009",
    "author": "phobos",
    "start_date": "2009-10-26",
    "end_date": "2009-10-27"
  },
  "lunar-14th-lsm-conference-brussels": {
    "title": "Lunar @ 14th LSM Conference, Brussels",
    "author": "kelley",
    "start_date": "2013-07-06",
    "end_date": "2013-07-11"
  },
  "matt-and-others-valencia-internet-freedom-festival": {
    "title": "Matt and others to Valencia for Internet Freedom Festival",
    "author": "arma",
    "start_date": "2017-03-06",
    "end_date": "2017-03-10"
  },
  "privacy-enhancing-technologies-symposium-darmstadt": {
    "title": "Privacy Enhancing Technologies Symposium, Darmstadt",
    "author": "arma",
    "start_date": "2016-02-03"
  },
  "karsten-and-others-pet-con-20091": {
    "title": "Karsten and others at PET-CON 2009.1",
    "author": "karsten",
    "start_date": "2009-03-24",
    "end_date": "2009-03-25"
  },
  "roger-steven-fc09": {
    "title": "Roger, Steven at FC09",
    "author": "arma",
    "start_date": "2009-02-23",
    "end_date": "2009-02-27"
  },
  "tor-meetup-berlin": {
    "title": "Tor Meetup (Berlin)",
    "author": "steph",
    "start_date": "2019-02-02"
  },
  "colin-childs-presenting-tor-cryptoparty-winnipeg": {
    "title": "Colin Childs Presenting Tor @ CryptoParty, Winnipeg",
    "author": "kelley",
    "start_date": "2014-02-09"
  },
  "isabela-presenting-primavera-hacker-chile": {
    "title": "Isabela presenting at Primavera Hacker in Chile",
    "author": "isabela",
    "start_date": "2016-11-05",
    "end_date": "2016-11-06"
  },
  "free-and-open-communications-on-the-internet-foci-workshop": {
    "title": "Free and Open Communications on the Internet (FOCI) workshop",
    "author": "arma",
    "start_date": "2021-08-27"
  },
  "asn-vasilis-and-others-hackerspacegr-athens-greece": {
    "title": "asn, vasilis and others at Hackerspace.gr, Athens, Greece",
    "author": "andz",
    "start_date": "2018-01-06"
  },
  "steven-paul-ian-others-oakland": {
    "title": "Steven, Paul, Ian, others at Oakland",
    "author": "arma",
    "start_date": "2008-05-19",
    "end_date": "2008-05-23"
  },
  "tor-meetup-hamburg": {
    "title": "Tor Meetup (Hamburg)",
    "author": "steph",
    "start_date": "2019-04-26"
  },
  "vasilis-rmll-saint-etienne-france": {
    "title": "Vasilis at RMLL, Saint Etienne, France",
    "author": "andz",
    "start_date": "2017-07-01",
    "end_date": "2017-07-07"
  },
  "andrew-bbc-radio-5-investigates": {
    "title": "Andrew on BBC Radio 5 Investigates",
    "author": "phobos",
    "start_date": "2012-02-05"
  },
  "tor-meetup-valencia": {
    "title": "Tor Meetup (Valencia)",
    "author": "steph",
    "start_date": "2019-03-28"
  },
  "privacy-sos-cryptoparty-northeastern-university-boston": {
    "title": "Privacy SOS CryptoParty at NorthEastern University in Boston",
    "author": "phobos",
    "start_date": "2014-02-09"
  },
  "gnu-health-con-las-palmas-spain": {
    "title": "GNU Health CON (Las Palmas, Spain)",
    "author": "steph",
    "start_date": "2018-11-23",
    "end_date": "2018-11-25"
  },
  "roger-new-york-city": {
    "title": "Roger in New York City",
    "author": "arma",
    "start_date": "2008-11-04",
    "end_date": "2008-11-06"
  },
  "libreplanet-boston": {
    "title": "LibrePlanet (Boston)",
    "author": "steph",
    "start_date": "2019-03-23",
    "end_date": "2019-03-24"
  },
  "tor-real-world-crypto-2014-new-york-city-usa": {
    "title": "Tor @ Real World Crypto 2014, New York City, USA",
    "author": "lunar",
    "start_date": "2014-01-13",
    "end_date": "2014-01-15"
  },
  "many-tor-and-ooni-people-turin-nexa-conference": {
    "title": "Many Tor and OONI people to Turin for Nexa conference",
    "author": "andz",
    "start_date": "2016-12-02"
  },
  "net-dev-vancouver": {
    "title": "Netdev 0x14 (Vancouver) **Postponed",
    "author": "steph",
    "start_date": "2020-06-16",
    "end_date": "2020-06-19"
  },
  "andrew-cascon": {
    "title": "Andrew at CASCON",
    "author": "phobos",
    "start_date": "2009-11-02",
    "end_date": "2009-11-05"
  },
  "roger-jacob-karsten-and-others-26c3": {
    "title": "Roger, Jacob, Karsten, and others at 26C3",
    "author": "phobos",
    "start_date": "2009-12-27",
    "end_date": "2009-12-30"
  },
  "apidaysio-barcelona": {
    "title": "APIdays.io (Barcelona)",
    "author": "steph",
    "start_date": "2019-09-12",
    "end_date": "2019-09-13"
  },
  "many-tor-people-minneapolis-pets": {
    "title": "Many Tor people to Minneapolis for PETS",
    "author": "arma",
    "start_date": "2017-07-17",
    "end_date": "2017-07-22"
  },
  "foci-workshop-baltimore": {
    "title": "FOCI Workshop (Baltimore)",
    "author": "arma",
    "start_date": "2018-08-14"
  },
  "b-sides-barcelona-2020": {
    "title": "BSides (Barcelona) **Postponed",
    "author": "steph",
    "start_date": "2020-05-08"
  },
  "roger-foci-13-washington-dc": {
    "title": "Roger @ FOCI '13, Washington, DC",
    "author": "kelley",
    "start_date": "2013-08-13"
  },
  "andrew-speaking-ieee-boston-chapter": {
    "title": "Andrew speaking at IEEE Boston Chapter",
    "author": "phobos",
    "start_date": "2012-03-19",
    "end_date": "2012-03-20"
  },
  "tor-presenting-new-media-inspiration-2014-prague-czech-republic": {
    "title": "Tor Presenting @ New Media Inspiration 2014, Prague, Czech Republic",
    "author": "kelley",
    "start_date": "2014-02-08"
  },
  "roger-speaks-eindhoven-university": {
    "title": "Roger speaks at Eindhoven University",
    "author": "arma",
    "start_date": "2016-05-26",
    "end_date": "2016-05-27"
  },
  "andrew-university-college-london": {
    "title": "Andrew at University College of London",
    "author": "phobos",
    "start_date": "2011-05-17"
  },
  "tor-browser-interface-freedom-buenos-aires": {
    "title": "Tor Browser: The interface for freedom (Buenos Aires)",
    "author": "ggus",
    "start_date": "2019-08-30"
  },
  "roger-andrew-wendy-others-computers-freedom-and-privacy": {
    "title": "Roger, Andrew, Wendy, others at Computers Freedom and Privacy",
    "author": "arma",
    "start_date": "2009-06-01",
    "end_date": "2009-06-04"
  },
  "ix-seminario-de-protecao-privacidade-e-aos-dados-pessoais-sao-paulo": {
    "title": "IX Semin\u00e1rio de Prote\u00e7\u00e3o \u00e0 Privacidade e aos Dados Pessoais (S\u00e3o Paulo)",
    "author": "ggus",
    "start_date": "2018-08-07",
    "end_date": "2018-08-08"
  },
  "andrew-blogfest-asia": {
    "title": "Andrew at Blogfest Asia",
    "author": "phobos",
    "start_date": "2009-11-06",
    "end_date": "2009-11-11"
  },
  "roger-jake-mike-karsten-gsoc-mentor-summit": {
    "title": "Roger, Jake, Mike, Karsten at GSoC mentor summit",
    "author": "arma",
    "start_date": "2009-10-23",
    "end_date": "2009-10-25"
  },
  "roger-does-two-tor-talks-israel": {
    "title": "Roger does two Tor talks in Israel",
    "author": "arma",
    "start_date": "2017-12-11",
    "end_date": "2017-12-13"
  },
  "roger-speaks-eff-san-francisco": {
    "title": "Roger speaks at EFF in San Francisco",
    "author": "arma",
    "start_date": "2015-10-19",
    "end_date": "2015-10-20"
  },
  "roger-keynotes-fung-forum-berlin": {
    "title": "Roger keynotes at Fung Forum in Berlin",
    "author": "arma",
    "start_date": "2017-03-20",
    "end_date": "2017-03-21"
  },
  "internet-freedom-hack-brisbane": {
    "title": "Internet Freedom Hack (Brisbane)",
    "author": "steph",
    "start_date": "2018-11-09",
    "end_date": "2018-11-11"
  },
  "tor-speaks-moscow-state-university": {
    "title": "Tor speaks at Moscow State University",
    "author": "erinn",
    "start_date": "2010-12-03"
  },
  "tor-breaking-through-internet-censorship": {
    "title": "Tor at Breaking through Internet Censorship",
    "author": "phobos",
    "start_date": "2012-03-12"
  },
  "jacob-it-defense-potsdam-germany": {
    "title": "Jacob at IT-Defense in Potsdam, Germany",
    "author": "ioerror",
    "start_date": "2009-02-12",
    "end_date": "2009-02-14"
  },
  "relay-operators-meetup-csoa-forte-prenestino-rome-italy": {
    "title": "Relay operators meetup @ CSOA Forte Prenestino, Rome, Italy",
    "author": "andz",
    "start_date": "2018-03-15"
  },
  "18th-privacy-enhancing-technologies-symposium-pets-barcelona": {
    "title": "The 18th Privacy Enhancing Technologies Symposium - PETS (Barcelona)",
    "author": "steph",
    "start_date": "2018-07-24",
    "end_date": "2018-07-27"
  },
  "roger-talks-aus-cert": {
    "title": "Roger talks at AUS-CERT",
    "author": "phobos",
    "start_date": "2010-05-14",
    "end_date": "2010-05-22"
  },
  "many-ooni-and-tor-people-toronto-citizen-lab-summer-institute": {
    "title": "Many OONI and Tor people to Toronto for Citizen Lab Summer Institute",
    "author": "andz",
    "start_date": "2017-07-12",
    "end_date": "2017-07-14"
  },
  "libreplanet-2017": {
    "title": "LibrePlanet 2017",
    "author": "isabela",
    "start_date": "2017-03-25",
    "end_date": "2017-03-26"
  },
  "personal-democracy-forum": {
    "title": "Personal Democracy Forum",
    "author": "phobos",
    "start_date": "2012-06-11",
    "end_date": "2012-06-12"
  },
  "foci-18-baltimore": {
    "title": "FOCI '18 (Baltimore)",
    "author": "steph",
    "start_date": "2018-08-14"
  },
  "usenix-security-baltimore": {
    "title": "Usenix Security (Baltimore)",
    "author": "steph",
    "start_date": "2018-08-15",
    "end_date": "2018-08-17"
  },
  "tor-booth-fosdem-2015": {
    "title": "Tor booth at FOSDEM 2015",
    "author": "lunar",
    "start_date": "2015-01-31",
    "end_date": "2015-02-01"
  },
  "tor-internet-and-democratic-change": {
    "title": "Tor at Internet and Democratic Change",
    "author": "phobos",
    "start_date": "2011-10-26",
    "end_date": "2011-10-27"
  },
  "winnipeg-cryptoparty-talking-tor": {
    "title": "Winnipeg CryptoParty Talking Tor",
    "author": "kelley",
    "start_date": "2013-09-29"
  },
  "tor-privacy-enhancing-technology-symposium": {
    "title": "Tor at Privacy Enhancing Technology Symposium",
    "author": "phobos",
    "start_date": "2011-07-27",
    "end_date": "2011-07-31"
  },
  "karen-and-kelley-sxsw-austin-tx": {
    "title": "Karen and Kelley @ SXSW, Austin, TX",
    "author": "kelley",
    "start_date": "2014-03-07",
    "end_date": "2014-03-11"
  },
  "tor-ghcon-2020": {
    "title": "Tor Talk at GNU Health Conference 2020",
    "author": "alsmith",
    "start_date": "2020-11-20"
  },
  "cryptorave-sao-paulo-0": {
    "title": "CryptoRave (S\u00e3o Paulo)",
    "author": "ggus",
    "start_date": "2019-05-03",
    "end_date": "2019-05-04"
  },
  "bornhack-2020": {
    "title": "Bornhack (DK)",
    "author": "ggus",
    "start_date": "2020-08-11",
    "end_date": "2020-08-18"
  },
  "roger-and-mike-defcon": {
    "title": "Roger and Mike at DEFCON",
    "author": "mikeperry",
    "start_date": "2008-08-08",
    "end_date": "2008-08-11"
  },
  "introduction-to-tor-and-onion-services-online-event": {
    "title": "Introduction to Tor and Onion services (online event)",
    "author": "kushal",
    "start_date": "2020-06-23"
  },
  "sukhbir-open-data-camp-bangalore": {
    "title": "Sukhbir at Open Data Camp, Bangalore",
    "author": "sukhbir",
    "start_date": "2017-04-22",
    "end_date": "2017-04-23"
  },
  "tor-hackfest-mit": {
    "title": "Tor Hackfest at MIT",
    "author": "phobos",
    "start_date": "2011-01-15"
  },
  "state-onion-libreplanet-cambridge-ma": {
    "title": "State of the Onion at LibrePlanet (Cambridge, MA)",
    "author": "alison",
    "start_date": "2018-03-24",
    "end_date": "2018-03-25"
  },
  "roger-does-talk-drexel-university": {
    "title": "Roger does talk at Drexel University",
    "author": "arma",
    "start_date": "2009-10-19"
  },
  "tor-27c3": {
    "title": "Tor at 27C3",
    "author": "phobos",
    "start_date": "2010-12-27",
    "end_date": "2010-12-30"
  },
  "tor-international-conference-cyber-security-fordham-university": {
    "title": "Tor at International Conference on Cyber Security - Fordham University",
    "author": "phobos",
    "start_date": "2010-08-02",
    "end_date": "2010-08-05"
  },
  "privchat-4": {
    "title": "PrivChat #4 - 25th Anniversary of Onion Routing",
    "author": "alsmith",
    "start_date": "2021-05-26"
  },
  "tor-project-february-hackfest": {
    "title": "Tor Project February Hackfest",
    "author": "phobos",
    "start_date": "2011-02-19"
  },
  "andrew-international-institute-communications": {
    "title": "Andrew at International Institute of Communications",
    "author": "phobos",
    "start_date": "2011-11-28",
    "end_date": "2011-11-29"
  },
  "jacob-source-boston-conference": {
    "title": "Jacob at SOURCE Boston Conference",
    "author": "phobos",
    "start_date": "2010-04-21",
    "end_date": "2010-04-23"
  },
  "egypcio-vasilis-and-others-tor-friends-and-relay-operators-meetup-onionspace-berlin": {
    "title": "Tor Friends and Relay Operators Meetup with Egypcio, Vasilis, and others at Onionspace (Berlin) -- in solidarity with Torservers",
    "author": "andz",
    "start_date": "2018-07-21"
  },
  "flisol-bogota": {
    "title": "Flisol Bogot\u00e1",
    "author": "ggus",
    "start_date": "2019-04-27"
  },
  "mozilla-all-hands-san-fran": {
    "title": "Mozilla All-Hands (San Fran)",
    "author": "steph",
    "start_date": "2018-06-11",
    "end_date": "2018-06-15"
  },
  "foss-north-2020": {
    "title": "Anonymity loves Diversity: The Case of Tor (Foss-North)",
    "author": "ggus",
    "start_date": "2020-11-01"
  },
  "embracing-dark-web-tool-privacy-and-anti-censorship-yale": {
    "title": "Embracing the Dark Web as a Tool for Privacy and Anti-Censorship (Yale)",
    "author": "steph",
    "start_date": "2018-10-23"
  },
  "jake-oslo-freedom-forum-oslo-norway": {
    "title": "Jake @ Oslo Freedom Forum, Oslo, Norway",
    "author": "kelley",
    "start_date": "2013-05-13",
    "end_date": "2013-05-15"
  },
  "karen-and-kelley-investigative-reporters-and-editors-conference-san-antonio-tx": {
    "title": "Karen and Kelley @ Investigative Reporters and Editors Conference, San Antonio, TX",
    "author": "kelley",
    "start_date": "2013-06-20",
    "end_date": "2013-06-23"
  },
  "kelley-women-cyber-security-conference-nashville-tn": {
    "title": "Kelley @ Women in Cyber Security Conference, Nashville, TN",
    "author": "kelley",
    "start_date": "2014-04-11",
    "end_date": "2014-04-12"
  },
  "mozilla-festival-london": {
    "title": "Mozilla Festival (London)",
    "author": "steph",
    "start_date": "2019-10-21",
    "end_date": "2019-10-27"
  },
  "roger-arlington-nsf-satc-pi-meeting": {
    "title": "Roger to Arlington for NSF SATC PI meeting",
    "author": "arma",
    "start_date": "2017-01-09",
    "end_date": "2017-01-11"
  },
  "andrew-sim-initiative-2020-vision-setting-long-term-agenda-global-media-development": {
    "title": "Andrew at SIM Initiative 2020 Vision: Setting a Long-Term Agenda for Global Media Development",
    "author": "phobos",
    "start_date": "2009-10-04",
    "end_date": "2009-10-08"
  },
  "stockholm-hackfest": {
    "title": "Stockholm Hackfest",
    "author": "phobos",
    "start_date": "2011-05-14",
    "end_date": "2011-05-15"
  },
  "nima-and-others-blackhat-def-con-las-vegas": {
    "title": "Nima and others at BlackHat / DEF CON in Las Vegas",
    "author": "mrphs",
    "start_date": "2015-08-01",
    "end_date": "2015-08-10"
  },
  "roger-martin-nick-others-codecon": {
    "title": "Roger, Martin, Nick, others at Codecon",
    "author": "arma",
    "start_date": "2009-04-17",
    "end_date": "2009-04-19"
  },
  "tom-l-ohm-geestmerambacht-near-alkmaar-netherlands": {
    "title": "Tom L. @ OHM, Geestmerambacht, near Alkmaar (The Netherlands)",
    "author": "kelley",
    "start_date": "2013-07-31",
    "end_date": "2013-08-04"
  },
  "tormenta-dialogos-feministas-para-las-libertades-y-autocuidados": {
    "title": "Tormenta: di\u00e1logos feministas para las libertades y autocuidados",
    "author": "ggus",
    "start_date": "2018-10-04"
  },
  "tor-privacy-enhancing-technology-symposium-0": {
    "title": "Tor at Privacy Enhancing Technology Symposium",
    "author": "phobos",
    "start_date": "2013-07-10",
    "end_date": "2013-07-12"
  },
  "introducao-ao-tor-ist-lisbon-portugal": {
    "title": "Introdu\u00e7\u00e3o ao Tor at IST (Lisbon, Portugal)",
    "author": "andz",
    "start_date": "2018-10-22"
  },
  "vasilis-enucomp-parnaiba-brazil": {
    "title": "Vasilis at ENUCOMP, Parna\u00edba, Brazil",
    "author": "andz",
    "start_date": "2017-11-15",
    "end_date": "2017-11-17"
  },
  "wosec-and-infosecgirls-workshop-pune": {
    "title": "WoSec and InfoSecGirls Workshop (Pune)",
    "author": "steph",
    "start_date": "2019-11-30"
  },
  "roger-nick-others-shmoocon": {
    "title": "Roger, Nick, others at Shmoocon",
    "author": "arma",
    "start_date": "2009-02-06",
    "end_date": "2009-02-08"
  },
  "andrew-consent-networked": {
    "title": "Andrew at Consent of the Networked",
    "author": "phobos",
    "start_date": "2012-02-03"
  },
  "ethics-in-security-and-privacy-research-panel": {
    "title": "Ethics in Security and Privacy Research Panel",
    "author": "arma",
    "start_date": "2021-05-25"
  },
  "amsterdam-tor-meeting": {
    "title": "Amsterdam Tor meeting",
    "author": "arma",
    "start_date": "2017-03-22",
    "end_date": "2017-03-27"
  },
  "paul-karsten-and-roger-financial-cryptography-and-data-security-10-conference": {
    "title": "Paul, Karsten, and Roger at Financial Cryptography and Data Security '10 Conference",
    "author": "phobos",
    "start_date": "2010-01-21",
    "end_date": "2010-02-01"
  },
  "roger-speaks-defcon": {
    "title": "Roger speaks at Defcon",
    "author": "arma",
    "start_date": "2017-07-28",
    "end_date": "2017-07-30"
  },
  "sukhbir-does-workshop-toronto-public-library-data-privacy-day": {
    "title": "Sukhbir does a workshop at Toronto Public Library (Data Privacy Day)",
    "author": "tommy",
    "start_date": "2018-01-25"
  },
  "wendy-nima-and-nathan-point-point-camp-cambridge": {
    "title": "Wendy, Nima and Nathan at Point to Point Camp in Cambridge",
    "author": "mrphs",
    "start_date": "2015-05-02",
    "end_date": "2015-05-03"
  },
  "usenix-leet-11": {
    "title": "Usenix LEET 11",
    "author": "phobos",
    "start_date": "2011-03-29",
    "end_date": "2011-03-30"
  },
  "tor-fosdem-brussels": {
    "title": "Tor @ FOSDEM, Brussels",
    "author": "kelley",
    "start_date": "2014-02-01"
  },
  "congresso-abraji-brasil": {
    "title": "Congresso Abraji (Brasil)",
    "author": "ggus",
    "start_date": "2019-06-27",
    "end_date": "2019-06-29"
  },
  "roger-princeton": {
    "title": "Roger at Princeton",
    "author": "arma",
    "start_date": "2009-04-09",
    "end_date": "2009-04-10"
  },
  "alisonlfp-speaks-new-jersey-library-association-conference": {
    "title": "Alison/LFP speaks at the New Jersey Library Association Conference",
    "author": "alison",
    "start_date": "2017-04-24",
    "end_date": "2017-04-26"
  },
  "roger-security-and-privacy-democracy-panel-dc": {
    "title": "Roger on \"security and privacy for democracy\" panel in DC",
    "author": "arma",
    "start_date": "2017-10-24"
  },
  "non-e-la-silicon-valley-ma-si-mangia-meglio-torino": {
    "title": "Non \u00e8 la silicon valley, ma si mangia meglio! (Torino)",
    "author": "ggus",
    "start_date": "2019-11-19",
    "end_date": "2019-11-21"
  },
  "alex-and-others-sha2017": {
    "title": "Alex and others at SHA2017",
    "author": "ahf",
    "start_date": "2017-08-04",
    "end_date": "2017-08-08"
  },
  "andrew-webinno22": {
    "title": "Andrew at WebInno22",
    "author": "phobos",
    "start_date": "2009-07-16"
  },
  "roger-wpes-and-ccs-phoenix": {
    "title": "Roger at WPES and CCS in Phoenix",
    "author": "arma",
    "start_date": "2014-11-03",
    "end_date": "2014-11-07"
  },
  "tor-privacy-enhancing-technologies-symposium-berlin-germany": {
    "title": "Tor at Privacy Enhancing Technologies Symposium in Berlin, Germany",
    "author": "phobos",
    "start_date": "2010-07-17",
    "end_date": "2010-07-26"
  },
  "roger-usenix-security-symposium-washington-dc": {
    "title": "Roger @ USENIX Security Symposium, Washington, DC",
    "author": "kelley",
    "start_date": "2013-08-14",
    "end_date": "2013-08-16"
  },
  "tor-sharing-taipei": {
    "title": "Tor Sharing (Taipei)",
    "author": "steph",
    "start_date": "2019-10-31"
  },
  "edri-capacity-building-event": {
    "title": "EDRI:  Capacity Building Event",
    "author": "phobos",
    "start_date": "2010-02-04",
    "end_date": "2010-02-05"
  },
  "andrew-wesleyan-university-0": {
    "title": "Andrew at Wesleyan University",
    "author": "phobos",
    "start_date": "2011-02-24"
  },
  "damian-linuxfest-nw": {
    "title": "Damian @ LinuxFest NW",
    "author": "kelley",
    "start_date": "2013-04-27",
    "end_date": "2013-04-28"
  },
  "safe-browsing-tor-beirut-lebanon-ramy-raoof": {
    "title": "Safe Browsing with Tor, Beirut, Lebanon (Ramy Raoof)",
    "author": "steph",
    "start_date": "2017-11-27"
  },
  "tor-28c3-berlin-germany": {
    "title": "Tor at 28C3 in Berlin, Germany",
    "author": "phobos",
    "start_date": "2011-12-27",
    "end_date": "2011-12-30"
  },
  "roger-foci-14-san-diego-ca": {
    "title": "Roger @ FOCI \u201914, San Diego, CA",
    "author": "lunar",
    "start_date": "2014-08-19"
  },
  "roger-jacob-san-francisco": {
    "title": "Roger, Jacob in San Francisco",
    "author": "arma",
    "start_date": "2008-11-12",
    "end_date": "2008-11-15"
  },
  "tor-meeting-montreal": {
    "title": "Tor Meeting in Montreal",
    "author": "arma",
    "start_date": "2017-10-14",
    "end_date": "2017-10-15"
  },
  "alison-does-tor-talk-texas-library-association-conference": {
    "title": "Alison does a Tor talk at the Texas Library Association Conference",
    "author": "alison",
    "start_date": "2018-04-03"
  },
  "fosscomm-2018-greece": {
    "title": "FOSSCOMM 2018 (Greece)",
    "author": "steph",
    "start_date": "2018-10-13"
  },
  "vasilis-ilv-and-others-cryptorave-2017": {
    "title": "Vasilis, ilv and others at CryptoRave 2017",
    "author": "andz",
    "start_date": "2017-05-05",
    "end_date": "2017-05-06"
  },
  "roger-jacob-mike-karsten-and-others-har-2009": {
    "title": "Roger, Jacob, Mike, Karsten, and others at HAR 2009",
    "author": "phobos",
    "start_date": "2009-08-11",
    "end_date": "2009-08-18"
  },
  "cryptorave-sao-paulo-2020": {
    "title": "CryptoRave (S\u00e3o Paulo) **Postponed",
    "author": "ggus",
    "start_date": "2020-05-15",
    "end_date": "2020-05-16"
  },
  "many-tor-people-mozilla-all-hands-austin": {
    "title": "Many Tor people to Mozilla All-Hands in Austin",
    "author": "arma",
    "start_date": "2017-12-11",
    "end_date": "2017-12-15"
  },
  "roger-others-wpes-and-acm-ccs-chicago": {
    "title": "Roger, others at WPES and ACM CCS, Chicago",
    "author": "arma",
    "start_date": "2010-10-03",
    "end_date": "2010-10-08"
  },
  "rights-con-rio": {
    "title": "Rights Con Rio",
    "author": "phobos",
    "start_date": "2012-05-31",
    "end_date": "2012-06-01"
  },
  "digital-security-training-kerala-india": {
    "title": "Digital Security Training in Kerala, India",
    "author": "sukhbir",
    "start_date": "2017-10-06"
  },
  "andrew-allied-media-conference": {
    "title": "Andrew at Allied Media Conference",
    "author": "phobos",
    "start_date": "2011-06-23",
    "end_date": "2011-06-26"
  },
  "london-internet-security-and-privacy-workshop": {
    "title": "London Internet Security and Privacy Workshop",
    "author": "phobos",
    "start_date": "2011-03-08"
  },
  "tor-meetup-berlin-feb2020": {
    "title": "Tor Meetup (Berlin)",
    "author": "ggus",
    "start_date": "2020-02-06"
  },
  "gnu-30th-anniversary-celebration-and-hackathon": {
    "title": "GNU 30th anniversary celebration and hackathon",
    "author": "phobos",
    "start_date": "2013-09-28",
    "end_date": "2013-09-29"
  },
  "tors-new-cambridge-offices-open-house": {
    "title": "Tor's New Cambridge Offices - OPEN HOUSE",
    "author": "kelley",
    "start_date": "2013-11-20"
  },
  "tor-35th-ieee-symposium-security-and-privacy-san-jose-ca": {
    "title": "Tor @ 35th IEEE Symposium on Security and Privacy, San Jose, CA",
    "author": "lunar",
    "start_date": "2014-05-18",
    "end_date": "2014-05-22"
  },
  "criptoaxe-salvador": {
    "title": "CriptoAxe (Salvador)",
    "author": "ggus",
    "start_date": "2018-12-08"
  },
  "roger-jake-many-others-31c3-hamburg": {
    "title": "Roger, Jake, many others at 31c3 in Hamburg",
    "author": "arma",
    "start_date": "2014-12-27",
    "end_date": "2014-12-30"
  },
  "andrew-and-jacob-stockholm-internet-forum": {
    "title": "Andrew and Jacob at Stockholm Internet Forum",
    "author": "phobos",
    "start_date": "2012-04-18"
  },
  "jacob-keynote-13th-australian-linux-conference": {
    "title": "Jacob keynote at 13th Australian Linux Conference",
    "author": "phobos",
    "start_date": "2012-01-16",
    "end_date": "2012-01-20"
  },
  "oct-2021-localization-hangout": {
    "title": "Localization Hangout",
    "author": "emmapeel",
    "start_date": "2021-10-15"
  },
  "bitcoin-2019-conference": {
    "title": "BITCOIN 2019 Conference",
    "author": "isabela",
    "start_date": "2019-06-25",
    "end_date": "2019-06-26"
  },
  "rightscon-2020": {
    "title": "Tor Project @ Rightscon: \"The Case for Privacy By Design\"",
    "author": "ggus",
    "start_date": "2020-07-27",
    "end_date": "2020-07-31"
  },
  "explore-tor-nyc-meetup-qa-isa": {
    "title": "Explore Tor, NYC! Meetup / Q&A with Isa",
    "author": "steph",
    "start_date": "2018-08-02"
  },
  "tor-community-night-barcelona": {
    "title": "Tor Community Night (Barcelona)",
    "author": "steph",
    "start_date": "2018-07-24"
  },
  "roger-nick-paul-washington-dc": {
    "title": "Roger, Nick, Paul in Washington DC",
    "author": "arma",
    "start_date": "2008-10-27",
    "end_date": "2008-10-30"
  },
  "ux-team-lead-linda-naeun-lee-speaks-sofia-bulgaria": {
    "title": "UX Team Lead Linda Naeun Lee speaks in Sofia, Bulgaria",
    "author": "tommy",
    "start_date": "2017-10-17",
    "end_date": "2017-10-19"
  },
  "meetup-explore-tor-lisboa-portugal": {
    "title": "Meetup: Explore Tor (Lisboa, Portugal)",
    "author": "steph",
    "start_date": "2018-06-28"
  },
  "imv-circumventing-censorship": {
    "title": "Circumventing Internet Censorship with Tor @ Internet Measurement Village",
    "author": "ggus",
    "start_date": "2020-06-30"
  },
  "digital-privacy-expo-toronto-library": {
    "title": "Digital Privacy Expo (Toronto Library)",
    "author": "steph",
    "start_date": "2018-09-22"
  },
  "roger-usenix-security-symposium-san-diego-ca": {
    "title": "Roger @ Usenix Security Symposium, San Diego, CA",
    "author": "kelley",
    "start_date": "2014-08-20",
    "end_date": "2014-08-22"
  },
  "tor-localization-hackathon": {
    "title": "Tor Localization Hackathon",
    "author": "alsmith",
    "start_date": "2020-11-06",
    "end_date": "2020-11-09"
  },
  "lunar-lsm-2014-montpellier-france": {
    "title": "Lunar @ LSM 2014, Montpellier, France",
    "author": "lunar",
    "start_date": "2014-07-05",
    "end_date": "2014-07-11"
  },
  "barnard-college-scholar-and-feminist-conference-self-defense-lab-alison": {
    "title": "Barnard College \"Scholar and Feminist\" Conference: Self-Defense Lab with Alison",
    "author": "alison",
    "start_date": "2018-02-16"
  },
  "many-tor-people-pets-philadelphia": {
    "title": "Many Tor people at PETS in Philadelphia",
    "author": "arma",
    "start_date": "2015-06-30",
    "end_date": "2015-07-03"
  },
  "alison-international-forum-freedom-research-paris-france": {
    "title": "Alison at the International Forum Freedom of Research, Paris, France",
    "author": "alison",
    "start_date": "2017-11-16",
    "end_date": "2017-11-18"
  },
  "sebastian-cryptoparty-frankfurt-germany": {
    "title": "Sebastian @ CryptoParty in Frankfurt, Germany",
    "author": "kelley",
    "start_date": "2013-05-19",
    "end_date": "2013-05-20"
  },
  "roger-workshop-free-and-open-communication-internet-foci": {
    "title": "Roger at Workshop on Free and Open Communication on the Internet (FOCI)",
    "author": "phobos",
    "start_date": "2011-02-24",
    "end_date": "2011-02-26"
  },
  "roger-presents-philly-tech-week": {
    "title": "Roger presents at Philly Tech Week",
    "author": "arma",
    "start_date": "2017-05-03"
  },
  "101-photos-press-freedom-25th-anniversary-reporters-without-borders": {
    "title": "101 Photos for Press Freedom: 25th Anniversary of Reporters without Borders",
    "author": "phobos",
    "start_date": "2012-03-28",
    "end_date": "2012-03-29"
  },
  "kelley-2014-car-conference-baltimore": {
    "title": "Kelley @ 2014 CAR Conference, Baltimore",
    "author": "kelley",
    "start_date": "2014-03-01"
  },
  "usenix-santa-clara": {
    "title": "USENIX (Santa Clara)",
    "author": "steph",
    "start_date": "2019-08-14",
    "end_date": "2019-08-16"
  },
  "many-tor-people-host-booth-fosdem-brussels": {
    "title": "Many Tor people host a booth at FOSDEM in Brussels",
    "author": "arma",
    "start_date": "2017-02-04",
    "end_date": "2017-02-05"
  },
  "roger-jacob-mike-mountain-view": {
    "title": "Roger, Jacob, Mike in Mountain View",
    "author": "arma",
    "start_date": "2008-10-24",
    "end_date": "2008-10-26"
  },
  "tor-30th-chaos-communication-congress-hamburg-germany": {
    "title": "Tor @ 30th Chaos Communication Congress, Hamburg, Germany",
    "author": "lunar",
    "start_date": "2013-12-27",
    "end_date": "2013-12-31"
  },
  "alison-presenting-hive76-hackerspace-philadelphia": {
    "title": "Alison presenting to Hive76 hackerspace in Philadelphia",
    "author": "alison",
    "start_date": "2017-07-01"
  },
  "runa-summercon-new-york-city": {
    "title": "Runa @ SummerCon, New York City",
    "author": "kelley",
    "start_date": "2013-06-07"
  },
  "many-tor-people-hope-nyc": {
    "title": "Many Tor people at HOPE in NYC",
    "author": "mrphs",
    "start_date": "2016-07-22"
  },
  "pune-india-dgplug-meetup-learn-about-privacy-tor-and-foss": {
    "title": "Pune, India dgplug meetup: Learn about privacy, Tor, and FOSS",
    "author": "tommy",
    "start_date": "2018-03-28"
  },
  "tor-global-voices-summit-2010": {
    "title": "Tor at Global Voices Summit 2010",
    "author": "phobos",
    "start_date": "2010-05-07",
    "end_date": "2010-05-08"
  },
  "jacob-digital-security-and-tactics-and-anti-authoritarians": {
    "title": "Jacob at Digital Security and Tactics For (and By) Anti Authoritarians",
    "author": "ioerror",
    "start_date": "2010-03-13"
  },
  "alison-does-library-freedom-project-training-university-washington": {
    "title": "Alison does a Library Freedom Project training at the University of Washington",
    "author": "alison",
    "start_date": "2018-01-16"
  },
  "roger-linus-internet-dagarna": {
    "title": "Roger, Linus at Internet Dagarna",
    "author": "phobos",
    "start_date": "2010-10-26",
    "end_date": "2010-10-28"
  },
  "privacy-tools-and-technologies-pune-india": {
    "title": "Privacy Tools and Technologies (Pune, India)",
    "author": "steph",
    "start_date": "2018-08-22"
  },
  "usenix-security-and-foci-austin": {
    "title": "Usenix Security and FOCI, Austin",
    "author": "arma",
    "start_date": "2016-08-08",
    "end_date": "2016-08-12"
  },
  "roger-lecturing-suny-stonybrook": {
    "title": "Roger lecturing at SUNY Stonybrook",
    "author": "phobos",
    "start_date": "2010-10-18",
    "end_date": "2010-10-19"
  },
  "tor-session-cs4cs-brooklyn": {
    "title": "Tor Session at CS4CS (Brooklyn)",
    "author": "steph",
    "start_date": "2018-08-15"
  },
  "privchat-privacy-in-2020-activism-covid19": {
    "title": "PrivChat with Tor - \"Online Privacy in 2020: Activism & COVID-19\" (live stream)",
    "author": "ggus",
    "start_date": "2020-06-23"
  },
  "tor-meetup-porto-alegre-brasil": {
    "title": "Tor Meetup Porto Alegre (Brasil)",
    "author": "ggus",
    "start_date": "2018-07-12"
  },
  "runa-itweb-security-summit-johannesburg-south-africa": {
    "title": "Runa @ ITWeb Security Summit, Johannesburg, South Africa",
    "author": "kelley",
    "start_date": "2013-05-07",
    "end_date": "2013-05-08"
  },
  "roger-speaking-montreal": {
    "title": "Roger speaking in Montreal",
    "author": "arma",
    "start_date": "2012-04-28",
    "end_date": "2012-04-30"
  },
  "andrew-libreplanet-2012": {
    "title": "Andrew at LibrePlanet 2012",
    "author": "phobos",
    "start_date": "2012-03-24",
    "end_date": "2012-03-25"
  },
  "dockercon-europe-barcelona": {
    "title": "DockerCon Europe (Barcelona)",
    "author": "steph",
    "start_date": "2018-12-03",
    "end_date": "2018-12-05"
  },
  "roger-dimacs-rutgers-university": {
    "title": "Roger @ DIMACS, Rutgers University",
    "author": "kelley",
    "start_date": "2013-05-30",
    "end_date": "2013-05-31"
  },
  "alison-does-library-freedom-project-training-georgetown-university": {
    "title": "Alison does a Library Freedom Project training at Georgetown University",
    "author": "alison",
    "start_date": "2018-01-26"
  },
  "ccc-virtual": {
    "title": "CCC (virtual)",
    "author": "arma",
    "start_date": "2020-12-27",
    "end_date": "2020-12-30"
  },
  "state-of-the-onion-2020-event": {
    "title": "State of the Onion: Tor & Community Updates from 2020",
    "author": "alsmith",
    "start_date": "2020-11-16"
  },
  "jacob-speaks-confidence-krakow": {
    "title": "Jacob speaks at Confidence Krakow",
    "author": "phobos",
    "start_date": "2010-05-25",
    "end_date": "2010-05-26"
  },
  "jacob-linuxfest-northwest": {
    "title": "Jacob at LinuxFest Northwest",
    "author": "ioerror",
    "start_date": "2011-04-30",
    "end_date": "2011-05-01"
  },
  "tor-circumvention-tech-summit-iv-berlin": {
    "title": "Tor @ Circumvention Tech Summit IV, Berlin",
    "author": "lunar",
    "start_date": "2013-09-29",
    "end_date": "2013-10-01"
  },
  "colin-childs-presenting-tor-cryptoparty-winnipeg-0": {
    "title": "Colin Childs Presenting Tor @ CryptoParty, Winnipeg",
    "author": "kelley",
    "start_date": "2014-06-08"
  },
  "roger-talking-philadelphia-linux-users-group": {
    "title": "Roger talking to Philadelphia Linux Users' Group",
    "author": "phobos",
    "start_date": "2010-02-04"
  },
  "vasilis-v-international-symposium-lavits-2017-santiago-chile": {
    "title": "Vasilis at V INTERNATIONAL SYMPOSIUM LAVITS 2017, Santiago, Chile",
    "author": "andz",
    "start_date": "2017-11-29",
    "end_date": "2017-12-01"
  },
  "researchers-and-practitioners-meetup-pets-amsterdam": {
    "title": "Researchers and Practitioners Meetup @ PETS, Amsterdam",
    "author": "moritz",
    "start_date": "2014-07-15"
  },
  "sukhbir-does-workshop-alternative-law-forum-bangalore": {
    "title": "Sukhbir does a workshop at Alternative Law Forum, Bangalore",
    "author": "sukhbir",
    "start_date": "2018-01-19"
  },
  "fosdem-brussels": {
    "title": "FOSDEM (Brussels)",
    "author": "steph",
    "start_date": "2019-02-02",
    "end_date": "2019-02-03"
  },
  "hackers-next-door-brooklyn": {
    "title": "Hackers Next Door (Brooklyn)",
    "author": "steph",
    "start_date": "2019-12-14",
    "end_date": "2019-12-15"
  },
  "teaching-privacy-libraries-webinar-alison": {
    "title": "Teaching Privacy in Libraries: Webinar with Alison",
    "author": "steph",
    "start_date": "2018-03-29"
  },
  "kelley-and-karen-knight-foundation-summer-challenge-event": {
    "title": "Kelley and Karen @ Knight Foundation Summer Challenge Event",
    "author": "kelley",
    "start_date": "2013-08-26",
    "end_date": "2013-08-27"
  },
  "kelley-cerias-symposium-purdue-university": {
    "title": "Kelley @ CERIAS Symposium, Purdue University",
    "author": "kelley",
    "start_date": "2014-03-25",
    "end_date": "2014-03-27"
  },
  "jake-consilience-2013-conference-bangalore-india": {
    "title": "Jake @ Consilience 2013 Conference, Bangalore, India",
    "author": "kelley",
    "start_date": "2013-05-25",
    "end_date": "2013-05-26"
  },
  "arthur-cybersecurity-best": {
    "title": "Arthur at Cybersecurity With The Best",
    "author": "steph",
    "start_date": "2017-10-14",
    "end_date": "2017-10-15"
  },
  "jacob-talking-about-tor-tokyo-japan-fsij-meeting": {
    "title": "Jacob talking about Tor in Tokyo, Japan at FSIJ meeting",
    "author": "ioerror",
    "start_date": "2015-01-22",
    "end_date": "2015-01-23"
  },
  "some-tor-people-rightscon-brussels": {
    "title": "Some Tor people to Rightscon, Brussels",
    "author": "arma",
    "start_date": "2017-03-29",
    "end_date": "2017-04-01"
  },
  "runa-social-media-lessons-learned-international-organizations-brussels": {
    "title": "Runa @ Social Media Lessons Learned from International Organizations, Brussels",
    "author": "kelley",
    "start_date": "2013-05-30"
  },
  "tor-techcamp-bangkok": {
    "title": "Tor at TechCamp Bangkok",
    "author": "phobos",
    "start_date": "2012-03-20",
    "end_date": "2012-03-22"
  },
  "tor-annual-dev-meeting": {
    "title": "Tor Annual Dev Meeting",
    "author": "phobos",
    "start_date": "2013-07-22"
  },
  "maria-and-arturo-presenting-ooni-oscal-tirana-albania": {
    "title": "Maria and Arturo presenting OONI at OSCAL in Tirana, Albania",
    "author": "art",
    "start_date": "2017-05-14"
  },
  "amogh-speaks-about-tor-nullcon-goa-india": {
    "title": "Amogh speaks about Tor at nullcon in Goa, India",
    "author": "alison",
    "start_date": "2018-03-02"
  },
  "v-jornades-internacionals-de-dones-en-el-sector-tic-barcelona": {
    "title": "V Jornades Internacionals de dones en el sector TIC (Barcelona)",
    "author": "ggus",
    "start_date": "2019-11-22"
  },
  "tor-speaks-reykjavik-digital-freedom-conference": {
    "title": "Tor speaks at Reykjav\u00edk Digital Freedom Conference",
    "author": "phobos",
    "start_date": "2010-12-01"
  },
  "cryptorave-sao-paulo": {
    "title": "CryptoRave (S\u00e3o Paulo)",
    "author": "steph",
    "start_date": "2018-05-04",
    "end_date": "2018-05-05"
  },
  "es-tor-talk-university-seville": {
    "title": "[es] Tor talk at the University of Seville",
    "author": "tommy",
    "start_date": "2018-02-20"
  },
  "alison-does-library-freedom-project-training-panama-city-florida": {
    "title": "Alison does a Library Freedom Project training in Panama City, Florida",
    "author": "alison",
    "start_date": "2018-03-29"
  },
  "citizen-lab-summer-institute-toronto": {
    "title": "Citizen Lab Summer Institute (Toronto)",
    "author": "steph",
    "start_date": "2018-06-13",
    "end_date": "2018-06-15"
  },
  "alison-presenting-society-american-archivists": {
    "title": "Alison presenting at Society of American Archivists",
    "author": "alison",
    "start_date": "2017-07-26"
  },
  "andrew-bostoncambridge-countersurveillance-discotech": {
    "title": "Andrew at Boston/Cambridge Countersurveillance DiscoTech",
    "author": "phobos",
    "start_date": "2014-03-01",
    "end_date": "2014-03-02"
  },
  "criptofesta-sao-paulo": {
    "title": "CriptoFesta (S\u00e3o Paulo)",
    "author": "steph",
    "start_date": "2018-12-01"
  },
  "tor-us-social-forum-2010": {
    "title": "Tor at US Social Forum 2010",
    "author": "phobos",
    "start_date": "2010-06-22",
    "end_date": "2010-06-26"
  },
  "tor-fscons": {
    "title": "Tor at FSCONS",
    "author": "phobos",
    "start_date": "2010-11-05"
  },
  "kelley-ona-conference-journalists-atlanta-ga": {
    "title": "Kelley @ ONA Conference for Journalists, Atlanta, GA",
    "author": "kelley",
    "start_date": "2013-10-17",
    "end_date": "2013-10-18"
  },
  "andrew-keynotes-broadband-world-forum": {
    "title": "Andrew Keynotes Broadband World Forum",
    "author": "phobos",
    "start_date": "2014-10-21",
    "end_date": "2014-10-23"
  },
  "ian-others-usenix-security-dc": {
    "title": "Ian, others at Usenix Security, DC",
    "author": "arma",
    "start_date": "2010-08-11",
    "end_date": "2010-08-14"
  },
  "tor-meetup-athens-greece": {
    "title": "Tor Meetup (Athens, Greece)",
    "author": "steph",
    "start_date": "2018-03-24"
  },
  "tor-libreplanet-2014-mit-cambridge-ma": {
    "title": "Tor @ LibrePlanet 2014, MIT, Cambridge, MA",
    "author": "kelley",
    "start_date": "2014-03-22",
    "end_date": "2014-03-23"
  },
  "roger-doing-invited-talk-real-world-crypto-london": {
    "title": "Roger doing invited talk at Real World Crypto in London",
    "author": "arma",
    "start_date": "2015-01-07",
    "end_date": "2015-01-09"
  },
  "jacob-google-io-san-francisco": {
    "title": "Jacob at Google IO in San Francisco",
    "author": "ioerror",
    "start_date": "2011-05-09",
    "end_date": "2011-05-11"
  },
  "roger-and-others-foci-usenix-security-dc": {
    "title": "Roger and others at FOCI / Usenix Security in DC",
    "author": "arma",
    "start_date": "2015-08-10",
    "end_date": "2015-08-15"
  },
  "sukhbir-toronto-public-librarys-lock-down-your-digital-privacy-course": {
    "title": "Sukhbir at Toronto Public Library's Lock Down Your Digital Privacy Course",
    "author": "sukhbir",
    "start_date": "2017-11-16"
  },
  "tor-dc-cryptoparty": {
    "title": "Tor @ DC CryptoParty",
    "author": "kelley",
    "start_date": "2013-10-25"
  },
  "tor-sourcebarcelona": {
    "title": "Tor at SourceBarcelona",
    "author": "phobos",
    "start_date": "2010-09-21",
    "end_date": "2010-09-22"
  },
  "internet-freedom-festival-valencia": {
    "title": "Internet Freedom Festival (Valencia)",
    "author": "steph",
    "start_date": "2019-04-01",
    "end_date": "2019-04-05"
  },
  "def-con-las-vegas-0": {
    "title": "DEF CON (Las Vegas)",
    "author": "steph",
    "start_date": "2019-08-08",
    "end_date": "2019-08-11"
  },
  "tor-debconf-2010-nyc": {
    "title": "Tor at DebConf 2010 in NYC",
    "author": "phobos",
    "start_date": "2010-08-01",
    "end_date": "2010-08-07"
  },
  "ii-seminario-criptografia-politica-e-direitos-fundamentais": {
    "title": "II Semin\u00e1rio Criptografia, Pol\u00edtica e Direitos Fundamentais",
    "author": "isabela",
    "start_date": "2021-08-05"
  },
  "Sustain-Summit-2020": {
    "title": "Sustain Summit 2020 (Brussels)",
    "author": "steph",
    "start_date": "2020-01-30"
  },
  "hope-nyc": {
    "title": "HOPE (NYC)",
    "author": "steph",
    "start_date": "2018-07-20",
    "end_date": "2018-07-22"
  },
  "criptodunas-fortaleza-brazil": {
    "title": "CriptoDunas (Fortaleza, Brazil)",
    "author": "steph",
    "start_date": "2019-11-11",
    "end_date": "2019-11-14"
  },
  "sukhbir-presenting-defcon416-toronto": {
    "title": "Sukhbir presenting at DEFCON416 in Toronto",
    "author": "sukhbir",
    "start_date": "2017-08-09"
  },
  "andrew-erinn-others-libreplanet-2010": {
    "title": "Andrew, Erinn, others at LibrePlanet 2010",
    "author": "phobos",
    "start_date": "2010-03-20",
    "end_date": "2010-03-22"
  },
  "many-ooni-people-clsi-toronto": {
    "title": "Many OONI people at CLSI in Toronto",
    "author": "andz",
    "start_date": "2016-07-06",
    "end_date": "2016-07-08"
  },
  "jacob-fisl-12-porto-alegre-brasil": {
    "title": "Jacob at FISL 12 in Porto Alegre, Brasil",
    "author": "ioerror",
    "start_date": "2011-06-30",
    "end_date": "2011-07-01"
  },
  "jake-farmhouse-conf-4-hollywood-california": {
    "title": "Jake @ Farmhouse Conf 4, Hollywood California",
    "author": "kelley",
    "start_date": "2013-05-04"
  },
  "tor-session-cs4cs-nyu-tandon": {
    "title": "Tor Session at CS4CS (NYU Tandon)",
    "author": "steph",
    "start_date": "2018-07-16"
  },
  "philipp-winter-foci-13-washington-dc": {
    "title": "Philipp Winter @ FOCI '13, Washington, DC",
    "author": "kelley",
    "start_date": "2013-08-13"
  },
  "andrew-talking-national-police-iceland": {
    "title": "Andrew talking to the National Police of Iceland",
    "author": "phobos",
    "start_date": "2011-05-12"
  },
  "roger-represents-america-national-academy-engineering": {
    "title": "Roger represents America for the National Academy of Engineering",
    "author": "arma",
    "start_date": "2015-04-16",
    "end_date": "2015-04-19"
  },
  "mumbai-tor-meetup-antonela-sukhbir": {
    "title": "Mumbai Tor Meetup (Antonela & Sukhbir)",
    "author": "steph",
    "start_date": "2018-01-20"
  },
  "iff-tor-village-valencia": {
    "title": "IFF and Tor Village (Valencia) **Cancelled",
    "author": "ggus",
    "start_date": "2020-04-20",
    "end_date": "2020-04-24"
  },
  "tor-dev-meeting-valencia": {
    "title": "Tor dev meeting in Valencia",
    "author": "arma",
    "start_date": "2016-02-26",
    "end_date": "2016-03-01"
  },
  "royal-military-college-canada": {
    "title": "Royal Military College of Canada",
    "author": "phobos",
    "start_date": "2011-03-30",
    "end_date": "2011-03-31"
  },
  "sausage": {
    "title": "SAUSAGE",
    "author": "phobos",
    "start_date": "2011-04-05",
    "end_date": "2011-04-06"
  },
  "tor-codebits": {
    "title": "Tor at CodeBits",
    "author": "phobos",
    "start_date": "2010-11-11",
    "end_date": "2010-11-13"
  },
  "libreplanet-2011": {
    "title": "LibrePlanet 2011",
    "author": "phobos",
    "start_date": "2011-03-19"
  },
  "andrew-boston-network-users-group-meeting": {
    "title": "Andrew @ Boston Network Users Group Meeting",
    "author": "phobos",
    "start_date": "2014-03-05"
  },
  "roger-talks-unm-albuquerque": {
    "title": "Roger talks at UNM, Albuquerque",
    "author": "arma",
    "start_date": "2010-04-12"
  },
  "privacy-enhancing-technologies-symposium-2012": {
    "title": "Privacy Enhancing Technologies Symposium 2012",
    "author": "phobos",
    "start_date": "2012-07-11",
    "end_date": "2012-07-13"
  },
  "global-encryption-day-2021": {
    "title": "Global Encryption Day",
    "author": "alsmith",
    "start_date": "2021-10-21"
  },
  "tor-winter-dev-meeting-2015": {
    "title": "Tor Winter Dev Meeting 2015",
    "author": "harmony",
    "start_date": "2015-03-01",
    "end_date": "2015-03-06"
  },
  "many-tor-people-hamburg-33c3": {
    "title": "Many Tor people to Hamburg for 33C3",
    "author": "arma",
    "start_date": "2016-12-26",
    "end_date": "2016-12-30"
  },
  "andrew-interview-internet-evolution": {
    "title": "Andrew interview at Internet Evolution",
    "author": "phobos",
    "start_date": "2010-11-11"
  },
  "andrew-and-nick-cfp2008": {
    "title": "Andrew and Nick at CFP2008",
    "author": "phobos",
    "start_date": "2008-05-20",
    "end_date": "2008-05-23"
  },
  "alex-and-others-bornhack": {
    "title": "Alex and others at BornHack",
    "author": "ahf",
    "start_date": "2017-08-22",
    "end_date": "2017-08-29"
  },
  "alison-does-library-freedom-project-training-free-library-philadelphia": {
    "title": "Alison does a Library Freedom Project training at the Free Library of Philadelphia",
    "author": "alison",
    "start_date": "2017-12-08"
  },
  "privchat-3-tor-advancing-human-rights": {
    "title": "PrivChat #3 - Tor Advancing Human Rights (livestream)",
    "author": "ggus",
    "start_date": "2020-12-11"
  },
  "def-con-las-vegas": {
    "title": "DEF CON (Las Vegas)",
    "author": "steph",
    "start_date": "2018-08-09",
    "end_date": "2018-08-12"
  },
  "many-tor-people-pets-and-hotpets-darmstadt": {
    "title": "Many Tor people at PETS and HotPETS in Darmstadt",
    "author": "arma",
    "start_date": "2016-07-18",
    "end_date": "2016-07-24"
  },
  "tor-relays-meetup-fosdem": {
    "title": "Tor relays meetup at FOSDEM",
    "author": "nicoo",
    "start_date": "2018-02-04"
  }
}