{
    "active": true,
    "aggregate_usage": null,
    "amount": 500,
    "amount_decimal": "500",
    "billing_scheme": "per_unit",
    "created": 1715388037,
    "currency": "usd",
    "id": "plan_Q5ESqGnur6YJJZ",
    "interval": "month",
    "interval_count": 1,
    "livemode": false,
    "metadata": {},
    "meter": null,
    "name": "web_donation_monthly_usd_500",
    "nickname": null,
    "object": "plan",
    "product": "prod_Q5ESJMomvArouo",
    "statement_descriptor": null,
    "tiers": null,
    "tiers_mode": null,
    "transform_usage": null,
    "trial_period_days": null,
    "usage_type": "licensed"
}