{
    "account_balance": 0,
    "address": null,
    "balance": 0,
    "created": 1715472061,
    "currency": null,
    "default_currency": null,
    "default_source": null,
    "delinquent": false,
    "description": null,
    "discount": null,
    "email": null,
    "id": "cus_Q5b2bZbfE8vhAs",
    "invoice_prefix": "2F409924",
    "invoice_settings": {
        "custom_fields": null,
        "default_payment_method": null,
        "footer": null,
        "rendering_options": null
    },
    "livemode": false,
    "metadata": {},
    "name": null,
    "next_invoice_sequence": 1,
    "object": "customer",
    "phone": null,
    "preferred_locales": [],
    "shipping": null,
    "sources": {
        "data": [],
        "has_more": false,
        "object": "list",
        "total_count": 0,
        "url": "/v1/customers/cus_Q5b2bZbfE8vhAs/sources"
    },
    "subscriptions": {
        "data": [],
        "has_more": false,
        "object": "list",
        "total_count": 0,
        "url": "/v1/customers/cus_Q5b2bZbfE8vhAs/subscriptions"
    },
    "tax_exempt": "none",
    "tax_ids": {
        "data": [],
        "has_more": false,
        "object": "list",
        "total_count": 0,
        "url": "/v1/customers/cus_Q5b2bZbfE8vhAs/tax_ids"
    },
    "tax_info": null,
    "tax_info_verification": null,
    "test_clock": null
}