{
    "id": "WH-77687562XN25889J2-8Y6T55435R66168T4",
    "create_time": "2019-01-01T01:20:54.000Z",
    "resource_type": "subscription",
    "event_type": "BILLING.SUBSCRIPTION.PAYMENT.FAILED",
    "summary": "Subscription payment failed",
    "resource": {
        "shipping_amount": {
            "currency_code": "USD",
            "value": "10.00"
        },
        "start_time": "2018-11-01T00:00:00Z",
        "update_time": "2018-12-10T21:20:49Z",
        "quantity": "20",
        "subscriber": {
            "name": {
                "given_name": "John",
                "surname": "Doe"
            },
            "email_address": "customer@example.com",
            "payer_id": "2J6QB8YJQSJRJ",
            "shipping_address": {
                "name": {
                    "full_name": "John Doe"
                },
                "address": {
                    "address_line_1": "2211 N First Street",
                    "address_line_2": "Building 17",
                    "admin_area_2": "San Jose",
                    "admin_area_1": "CA",
                    "postal_code": "95131",
                    "country_code": "US"
                }
            }
        },
        "billing_info": {
            "outstanding_balance": {
                "currency_code": "USD",
                "value": "10.00"
            },
            "cycle_executions": [
                {
                    "tenure_type": "TRIAL",
                    "sequence": 1,
                    "cycles_completed": 1,
                    "cycles_remaining": 0,
                    "current_pricing_scheme_version": 1
                },
                {
                    "tenure_type": "REGULAR",
                    "sequence": 2,
                    "cycles_completed": 1,
                    "cycles_remaining": 0,
                    "current_pricing_scheme_version": 1
                }
            ],
            "last_payment": {
                "amount": {
                    "currency_code": "USD",
                    "value": "500.00"
                },
                "time": "2018-12-01T01:20:49Z"
            },
            "last_failed_payment": {
                "amount": {
                    "currency_code": "USD",
                    "value": "500.00"
                },
                "time": "2019-01-01T01:20:49Z",
                "reason_code": "PAYMENT_DENIED",
                "next_payment_retry_date": "2019-01-06T01:20:49Z"
            },
            "next_billing_time": "2019-01-01T00:20:49Z",
            "final_payment_time": "2020-01-01T00:20:49Z",
            "failed_payments_count": 2
        },
        "create_time": "2018-10-20T21:20:49Z",
        "links": [
            {
                "href": "https://api.sandbox.paypal.com/v1/billing/subscriptions/I-BW452GLLEP1G?fields=last_failed_payment",
                "rel": "self",
                "method": "GET"
            }
        ],
        "id": "I-BW452GLLEP1G",
        "plan_id": "P-5ML4271244454362WXNWU5NQ",
        "status": "ACTIVE",
        "status_update_time": "2018-12-10T21:20:49Z"
    },
    "links": [
        {
            "href": "https://api.sandbox.paypal.com/v1/notifications/webhooks-events/WH-77687562XN25889J2-8Y6T55435R66168T4",
            "rel": "self",
            "method": "GET",
            "encType": "application/json"
        },
        {
            "href": "https://api.sandbox.paypal.com/v1/notifications/webhooks-events/WH-77687562XN25889J2-8Y6T55435R66168T4/resend",
            "rel": "resend",
            "method": "POST",
            "encType": "application/json"
        },
        {
            "href": "https://api.sandbox.paypal.com/v1/billing/subscriptions/I-BW452GLLEP1G",
            "rel": "subscription",
            "method": "GET",
            "encType": "application/json"
        }
    ],
    "event_version": "1.0",
    "resource_version": "2.0"
}