<svg width="28" height="28" viewBox="0 0 28 28" fill="none" xmlns="http://www.w3.org/2000/svg">
<g id="terminal">
<mask id="mask0_1_195" style="mask-type:alpha" maskUnits="userSpaceOnUse" x="0" y="0" width="28" height="28">
<rect id="Bounding box" width="28" height="28" fill="#D9D9D9"/>
</mask>
<g mask="url(#mask0_1_195)">
<path id="terminal_2" d="M4.66652 23.3334C4.02486 23.3334 3.47555 23.1049 3.01861 22.648C2.56166 22.1911 2.33319 21.6417 2.33319 21.0001V7.00008C2.33319 6.35841 2.56166 5.80911 3.01861 5.35216C3.47555 4.89522 4.02486 4.66675 4.66652 4.66675H23.3332C23.9749 4.66675 24.5242 4.89522 24.9811 5.35216C25.4381 5.80911 25.6665 6.35841 25.6665 7.00008V21.0001C25.6665 21.6417 25.4381 22.1911 24.9811 22.648C24.5242 23.1049 23.9749 23.3334 23.3332 23.3334H4.66652ZM4.66652 21.0001H23.3332V9.33342H4.66652V21.0001ZM10.1207 15.1667L7.90402 12.9501C7.67069 12.7167 7.55889 12.4445 7.56861 12.1334C7.57833 11.8223 7.69986 11.5501 7.93319 11.3167C8.16652 11.1029 8.43875 10.9911 8.74986 10.9813C9.06097 10.9716 9.33319 11.0834 9.56652 11.3167L12.5999 14.3501C12.8332 14.5834 12.9499 14.8556 12.9499 15.1667C12.9499 15.4779 12.8332 15.7501 12.5999 15.9834L9.56652 19.0167C9.35264 19.2306 9.08527 19.3424 8.76444 19.3522C8.44361 19.3619 8.16652 19.2501 7.93319 19.0167C7.7193 18.8029 7.61236 18.5306 7.61236 18.2001C7.61236 17.8695 7.7193 17.5973 7.93319 17.3834L10.1207 15.1667ZM15.1665 19.8334C14.836 19.8334 14.5589 19.7216 14.3353 19.498C14.1117 19.2744 13.9999 18.9973 13.9999 18.6667C13.9999 18.3362 14.1117 18.0591 14.3353 17.8355C14.5589 17.6119 14.836 17.5001 15.1665 17.5001H19.8332C20.1637 17.5001 20.4408 17.6119 20.6644 17.8355C20.8881 18.0591 20.9999 18.3362 20.9999 18.6667C20.9999 18.9973 20.8881 19.2744 20.6644 19.498C20.4408 19.7216 20.1637 19.8334 19.8332 19.8334H15.1665Z" fill="#181F2F"/>
</g>
</g>
</svg>
