f5b1f3ff7e9e6b546d0a61a24f6ffa75 *ConfigFile.py
f47a9ac78a7d7f9019b693f621a1e9f4 *IDENT_Client.py
0224b0f2af2c92c32263594f668cb80a *IPv4_Tools.py
fd0a4c4a9757171f25d87dcb4192a864 *PySocks.py
3dc37fd65dd23df4e5778e7ae601e197 *SocketServer2.py
67d2906ea9029ca3c4ad821349e62b41 *CHANGES.txt
155cfe6f40b9720406cae4620f580766 *COPYRIGHT.txt
2dd5da8556f364231c193535998358fe *GPL.txt
adc5b411e3eac340b45eab114e7034a1 *INSTALL.txt
253a6a2ccb29c9e3a713d169880c0f4c *README.txt
3b0ae330425cb37f807c4e8d77aebf5e *TODO.txt
185f5b5321d87b9dc615b57061c21aaa *sample_config.conf
